{"text_format":"1","workbook":"xlsx","n_sheets":6,"sheets":["Roll Up","Roster","Fee Table","Offices","Drop Down","IndexMatch"],"not_rendered":{"charts":0,"images":0,"macros":0,"external_links":0,"defined_names":9,"comments":0,"pivot_tables":0},"unopened":[],"bounds":{"document_bytes":16777216,"sheet_cells":100000,"rows_first":2000,"rows_last":500,"rows_between":2000,"halvings":0,"cell_chars":16384,"cell_head_chars":4096},"cells_cut":0,"cells_raw":0,"read":"whole","date_system":"1900"}

{"sheet":"Roll Up","index":0,"n_rows":98,"n_cols":10,"rows_kept":98,"cut":false,"hidden":false,"merged":[[39,4,39,6],[40,4,40,6],[0,2,0,9],[1,2,1,9],[2,2,2,8],[9,1,9,10],[5,4,5,8],[30,4,30,6],[18,9,19,10],[18,8,19,8],[21,4,21,6],[36,8,37,8],[12,2,15,10],[18,2,19,6],[27,2,28,6],[36,2,37,6],[41,4,41,6],[45,8,46,8],[45,2,46,6],[83,1,85,9],[50,4,50,6],[54,9,55,10],[45,9,46,10],[48,4,48,6],[49,4,49,6],[54,2,55,6],[57,4,57,6],[58,4,58,6],[59,4,59,6],[54,8,55,8],[91,9,93,9],[92,1,93,5],[63,2,64,6],[77,4,77,6],[75,4,75,6],[76,4,76,6],[72,2,73,2],[72,8,73,8],[72,9,73,10],[66,4,66,6],[67,4,67,6],[68,4,68,6],[63,8,64,8],[63,9,64,10],[89,1,90,8],[36,9,37,10],[27,8,28,8],[27,9,28,10],[22,4,22,6],[23,4,23,6],[31,4,31,6],[32,4,32,6]]}
[null,null,"WASHINGTON STATE DEPARTMENT OF CHILDREN, YOUTH, AND FAMILIES"]
[null,null,"CPA Billing Form"]
[]
[null,null,"Month of Service:",null,"Select",null,"Year:",null,"Select"]
[]
[null,null,"Provider Name:"]
[]
[null,null,"FamLink Provider #:",null,null,null,"Contract #:"]
[]
[null,"Please Complete the \"Roster\" Tab"]
[]
[]
[null,null,"- This Billing Form is Meant to provide a monthly invoice for case aide.\n- Provider Resource Support Levels will be opened independently without the need for paperwork; however, this form allows for the CPA to note which cases have not received an invoice for Provider Resource Support to reduce delays in payment."]
[]
[]
{"$rows_left_out":84}
{"sheet":"Roster","index":1,"n_rows":494,"n_cols":22,"rows_kept":494,"cut":false,"hidden":false,"merged":[]}
["Month of Service","Child Name","Child ID","Case Name","Case Number","Service Start Date","Service End Date","County Where Youth Resides","DCYF Case Region","Hidden Region Column","DCYF Case Office","Child Support Level","Has Payment Been Opened for Provider Resource Support","Provider Resource Support Due","Case Aide Hours","Hide Column","Case Aide Travel Time","Total Case Aide","Case Aide Due","AAR Required","Mileage","Mileage Due (Paid by Lump Sum)"]
["Select","-","-","-","-","DD/MM/YYYY","DD/MM/YYYY","Select","Select",{"$f":"VLOOKUP(Table1[[#This Row],[DCYF Case Region]],'Drop Down'!$F$3:$G$9,2,0)","v":"Select"},"Select","Select","Select",{"$f":"IFERROR(IF(M2=\"No\",INDEX(IndexMatch!C:C,MATCH(1,(IndexMatch!A:A=VLOOKUP(H2,'Drop Down'!K:L,2,0))*(IndexMatch!B:B=L2),0)),\"Service Already Opened\"),\"N/A\")","v":"Service Already Opened"},0,{"$f":"IF(O2>VLOOKUP(L2,'Drop Down'!$A$3:$B$10,2,0),\"1\",\"0\")","v":"0"},0,{"$f":"SUM(Table1[[#This Row],[Case Aide Hours]],Table1[[#This Row],[Case Aide Travel Time]])","v":0},{"$f":"IFERROR(IF(OR(Table1[[#This Row],[Child Support Level]]=\"Support Services Lvl 1\", Table1[[#This Row],[Child Support Level]]=\"Support Services Lvl 2\",Table1[[#This Row],[Child Support Level]]=\"Select\"),\"Case Aid Not Allowed\", PRODUCT(Table1[[#This Row],[Total Case Aide]],VLOOKUP(Table1[[#This Row],[County Where Youth Resides]],'Drop Down'!K:M,3,0))),\"0\")","v":"Case Aid Not Allowed"},{"$f":"IF(P2=\"1\",\"Yes\",\"No\")","v":"No"},0,{"$f":"ROUND(PRODUCT(U2,0.67),2)","v":0}]
["Select","-","-","-","-","DD/MM/YYYY","DD/MM/YYYY","Select","Select",{"$f":"VLOOKUP(Table1[[#This Row],[DCYF Case Region]],'Drop Down'!$F$3:$G$9,2,0)","v":"Select"},"Select","Select","Select",{"$f":"IFERROR(IF(M3=\"No\",INDEX(IndexMatch!C:C,MATCH(1,(IndexMatch!A:A=VLOOKUP(H3,'Drop Down'!K:L,2,0))*(IndexMatch!B:B=L3),0)),\"Service Already Opened\"),\"N/A\")","v":"Service Already Opened"},0,{"$f":"IF(O3>VLOOKUP(L3,'Drop Down'!$A$3:$B$10,2,0),\"1\",\"0\")","v":"0"},0,{"$f":"SUM(Table1[[#This Row],[Case Aide Hours]],Table1[[#This Row],[Case Aide Travel Time]])","v":0},{"$f":"IFERROR(IF(OR(Table1[[#This Row],[Child Support Level]]=\"Support Services Lvl 1\", Table1[[#This Row],[Child Support Level]]=\"Support Services Lvl 2\",Table1[[#This Row],[Child Support Level]]=\"Select\"),\"Case Aid Not Allowed\", PRODUCT(Table1[[#This Row],[Total Case Aide]],VLOOKUP(Table1[[#This Row],[County Where Youth Resides]],'Drop Down'!K:M,3,0))),\"0\")","v":"Case Aid Not Allowed"},{"$f":"IF(P3=\"1\",\"Yes\",\"No\")","v":"No"},0,0]
["Select","-","-","-","-","DD/MM/YYYY","DD/MM/YYYY","Select","Select",{"$f":"VLOOKUP(Table1[[#This Row],[DCYF Case Region]],'Drop Down'!$F$3:$G$9,2,0)","v":"Select"},"Select","Select","Select",{"$f":"IFERROR(IF(M4=\"No\",INDEX(IndexMatch!C:C,MATCH(1,(IndexMatch!A:A=VLOOKUP(H4,'Drop Down'!K:L,2,0))*(IndexMatch!B:B=L4),0)),\"Service Already Opened\"),\"N/A\")","v":"Service Already Opened"},0,{"$f":"IF(O4>VLOOKUP(L4,'Drop Down'!$A$3:$B$10,2,0),\"1\",\"0\")","v":"0"},0,{"$f":"SUM(Table1[[#This Row],[Case Aide Hours]],Table1[[#This Row],[Case Aide Travel Time]])","v":0},{"$f":"IFERROR(IF(OR(Table1[[#This Row],[Child Support Level]]=\"Support Services Lvl 1\", Table1[[#This Row],[Child Support Level]]=\"Support Services Lvl 2\",Table1[[#This Row],[Child Support Level]]=\"Select\"),\"Case Aid Not Allowed\", PRODUCT(Table1[[#This Row],[Total Case Aide]],VLOOKUP(Table1[[#This Row],[County Where Youth Resides]],'Drop Down'!K:M,3,0))),\"0\")","v":"Case Aid Not Allowed"},"No",0,0]
["Select","-","-","-","-","DD/MM/YYYY","DD/MM/YYYY","Select","Select",{"$f":"VLOOKUP(Table1[[#This Row],[DCYF Case Region]],'Drop Down'!$F$3:$G$9,2,0)","v":"Select"},"Select","Select","Select",{"$f":"IFERROR(IF(M5=\"No\",INDEX(IndexMatch!C:C,MATCH(1,(IndexMatch!A:A=VLOOKUP(H5,'Drop Down'!K:L,2,0))*(IndexMatch!B:B=L5),0)),\"Service Already Opened\"),\"N/A\")","v":"Service Already Opened"},0,{"$f":"IF(O5>VLOOKUP(L5,'Drop Down'!$A$3:$B$10,2,0),\"1\",\"0\")","v":"0"},0,{"$f":"SUM(Table1[[#This Row],[Case Aide Hours]],Table1[[#This Row],[Case Aide Travel Time]])","v":0},{"$f":"IFERROR(IF(OR(Table1[[#This Row],[Child Support Level]]=\"Support Services Lvl 1\", Table1[[#This Row],[Child Support Level]]=\"Support Services Lvl 2\",Table1[[#This Row],[Child Support Level]]=\"Select\"),\"Case Aid Not Allowed\", PRODUCT(Table1[[#This Row],[Total Case Aide]],VLOOKUP(Table1[[#This Row],[County Where Youth Resides]],'Drop Down'!K:M,3,0))),\"0\")","v":"Case Aid Not Allowed"},"No",0,0]
["Select","-","-","-","-","DD/MM/YYYY","DD/MM/YYYY","Select","Select",{"$f":"VLOOKUP(Table1[[#This Row],[DCYF Case Region]],'Drop Down'!$F$3:$G$9,2,0)","v":"Select"},"Select","Select","Select",{"$f":"IFERROR(IF(M6=\"No\",INDEX(IndexMatch!C:C,MATCH(1,(IndexMatch!A:A=VLOOKUP(H6,'Drop Down'!K:L,2,0))*(IndexMatch!B:B=L6),0)),\"Service Already Opened\"),\"N/A\")","v":"Service Already Opened"},0,{"$f":"IF(O6>VLOOKUP(L6,'Drop Down'!$A$3:$B$10,2,0),\"1\",\"0\")","v":"0"},0,{"$f":"SUM(Table1[[#This Row],[Case Aide Hours]],Table1[[#This Row],[Case Aide Travel Time]])","v":0},{"$f":"IFERROR(IF(OR(Table1[[#This Row],[Child Support Level]]=\"Support Services Lvl 1\", Table1[[#This Row],[Child Support Level]]=\"Support Services Lvl 2\",Table1[[#This Row],[Child Support Level]]=\"Select\"),\"Case Aid Not Allowed\", PRODUCT(Table1[[#This Row],[Total Case Aide]],VLOOKUP(Table1[[#This Row],[County Where Youth Resides]],'Drop Down'!K:M,3,0))),\"0\")","v":"Case Aid Not Allowed"},"No",0,0]
["Select","-","-","-","-","DD/MM/YYYY","DD/MM/YYYY","Select","Select",{"$f":"VLOOKUP(Table1[[#This Row],[DCYF Case Region]],'Drop Down'!$F$3:$G$9,2,0)","v":"Select"},"Select","Select","Select",{"$f":"IFERROR(IF(M7=\"No\",INDEX(IndexMatch!C:C,MATCH(1,(IndexMatch!A:A=VLOOKUP(H7,'Drop Down'!K:L,2,0))*(IndexMatch!B:B=L7),0)),\"Service Already Opened\"),\"N/A\")","v":"Service Already Opened"},0,{"$f":"IF(O7>VLOOKUP(L7,'Drop Down'!$A$3:$B$10,2,0),\"1\",\"0\")","v":"0"},0,{"$f":"SUM(Table1[[#This Row],[Case Aide Hours]],Table1[[#This Row],[Case Aide Travel Time]])","v":0},{"$f":"IFERROR(IF(OR(Table1[[#This Row],[Child Support Level]]=\"Support Services Lvl 1\", Table1[[#This Row],[Child Support Level]]=\"Support Services Lvl 2\",Table1[[#This Row],[Child Support Level]]=\"Select\"),\"Case Aid Not Allowed\", PRODUCT(Table1[[#This Row],[Total Case Aide]],VLOOKUP(Table1[[#This Row],[County Where Youth Resides]],'Drop Down'!K:M,3,0))),\"0\")","v":"Case Aid Not Allowed"},"No",0,0]
["Select","-","-","-","-","DD/MM/YYYY","DD/MM/YYYY","Select","Select",{"$f":"VLOOKUP(Table1[[#This Row],[DCYF Case Region]],'Drop Down'!$F$3:$G$9,2,0)","v":"Select"},"Select","Select","Select",{"$f":"IFERROR(IF(M8=\"No\",INDEX(IndexMatch!C:C,MATCH(1,(IndexMatch!A:A=VLOOKUP(H8,'Drop Down'!K:L,2,0))*(IndexMatch!B:B=L8),0)),\"Service Already Opened\"),\"N/A\")","v":"Service Already Opened"},0,{"$f":"IF(O8>VLOOKUP(L8,'Drop Down'!$A$3:$B$10,2,0),\"1\",\"0\")","v":"0"},0,{"$f":"SUM(Table1[[#This Row],[Case Aide Hours]],Table1[[#This Row],[Case Aide Travel Time]])","v":0},{"$f":"IFERROR(IF(OR(Table1[[#This Row],[Child Support Level]]=\"Support Services Lvl 1\", Table1[[#This Row],[Child Support Level]]=\"Support Services Lvl 2\",Table1[[#This Row],[Child Support Level]]=\"Select\"),\"Case Aid Not Allowed\", PRODUCT(Table1[[#This Row],[Total Case Aide]],VLOOKUP(Table1[[#This Row],[County Where Youth Resides]],'Drop Down'!K:M,3,0))),\"0\")","v":"Case Aid Not Allowed"},"No",0,0]
["Select","-","-","-","-","DD/MM/YYYY","DD/MM/YYYY","Select","Select",{"$f":"VLOOKUP(Table1[[#This Row],[DCYF Case Region]],'Drop Down'!$F$3:$G$9,2,0)","v":"Select"},"Select","Select","Select",{"$f":"IFERROR(IF(M9=\"No\",INDEX(IndexMatch!C:C,MATCH(1,(IndexMatch!A:A=VLOOKUP(H9,'Drop Down'!K:L,2,0))*(IndexMatch!B:B=L9),0)),\"Service Already Opened\"),\"N/A\")","v":"Service Already Opened"},0,{"$f":"IF(O9>VLOOKUP(L9,'Drop Down'!$A$3:$B$10,2,0),\"1\",\"0\")","v":"0"},0,{"$f":"SUM(Table1[[#This Row],[Case Aide Hours]],Table1[[#This Row],[Case Aide Travel Time]])","v":0},{"$f":"IFERROR(IF(OR(Table1[[#This Row],[Child Support Level]]=\"Support Services Lvl 1\", Table1[[#This Row],[Child Support Level]]=\"Support Services Lvl 2\",Table1[[#This Row],[Child Support Level]]=\"Select\"),\"Case Aid Not Allowed\", PRODUCT(Table1[[#This Row],[Total Case Aide]],VLOOKUP(Table1[[#This Row],[County Where Youth Resides]],'Drop Down'!K:M,3,0))),\"0\")","v":"Case Aid Not Allowed"},"No",0,0]
["Select","-","-","-","-","DD/MM/YYYY","DD/MM/YYYY","Select","Select",{"$f":"VLOOKUP(Table1[[#This Row],[DCYF Case Region]],'Drop Down'!$F$3:$G$9,2,0)","v":"Select"},"Select","Select","Select",{"$f":"IFERROR(IF(M10=\"No\",INDEX(IndexMatch!C:C,MATCH(1,(IndexMatch!A:A=VLOOKUP(H10,'Drop Down'!K:L,2,0))*(IndexMatch!B:B=L10),0)),\"Service Already Opened\"),\"N/A\")","v":"Service Already Opened"},0,{"$f":"IF(O10>VLOOKUP(L10,'Drop Down'!$A$3:$B$10,2,0),\"1\",\"0\")","v":"0"},0,{"$f":"SUM(Table1[[#This Row],[Case Aide Hours]],Table1[[#This Row],[Case Aide Travel Time]])","v":0},{"$f":"IFERROR(IF(OR(Table1[[#This Row],[Child Support Level]]=\"Support Services Lvl 1\", Table1[[#This Row],[Child Support Level]]=\"Support Services Lvl 2\",Table1[[#This Row],[Child Support Level]]=\"Select\"),\"Case Aid Not Allowed\", PRODUCT(Table1[[#This Row],[Total Case Aide]],VLOOKUP(Table1[[#This Row],[County Where Youth Resides]],'Drop Down'!K:M,3,0))),\"0\")","v":"Case Aid Not Allowed"},"No",0,0]
["Select","-","-","-","-","DD/MM/YYYY","DD/MM/YYYY","Select","Select",{"$f":"VLOOKUP(Table1[[#This Row],[DCYF Case Region]],'Drop Down'!$F$3:$G$9,2,0)","v":"Select"},"Select","Select","Select",{"$f":"IFERROR(IF(M11=\"No\",INDEX(IndexMatch!C:C,MATCH(1,(IndexMatch!A:A=VLOOKUP(H11,'Drop Down'!K:L,2,0))*(IndexMatch!B:B=L11),0)),\"Service Already Opened\"),\"N/A\")","v":"Service Already Opened"},0,{"$f":"IF(O11>VLOOKUP(L11,'Drop Down'!$A$3:$B$10,2,0),\"1\",\"0\")","v":"0"},0,{"$f":"SUM(Table1[[#This Row],[Case Aide Hours]],Table1[[#This Row],[Case Aide Travel Time]])","v":0},{"$f":"IFERROR(IF(OR(Table1[[#This Row],[Child Support Level]]=\"Support Services Lvl 1\", Table1[[#This Row],[Child Support Level]]=\"Support Services Lvl 2\",Table1[[#This Row],[Child Support Level]]=\"Select\"),\"Case Aid Not Allowed\", PRODUCT(Table1[[#This Row],[Total Case Aide]],VLOOKUP(Table1[[#This Row],[County Where Youth Resides]],'Drop Down'!K:M,3,0))),\"0\")","v":"Case Aid Not Allowed"},"No",0,0]
["Select","-","-","-","-","DD/MM/YYYY","DD/MM/YYYY","Select","Select",{"$f":"VLOOKUP(Table1[[#This Row],[DCYF Case Region]],'Drop Down'!$F$3:$G$9,2,0)","v":"Select"},"Select","Select","Select",{"$f":"IFERROR(IF(M12=\"No\",INDEX(IndexMatch!C:C,MATCH(1,(IndexMatch!A:A=VLOOKUP(H12,'Drop Down'!K:L,2,0))*(IndexMatch!B:B=L12),0)),\"Service Already Opened\"),\"N/A\")","v":"Service Already Opened"},0,{"$f":"IF(O12>VLOOKUP(L12,'Drop Down'!$A$3:$B$10,2,0),\"1\",\"0\")","v":"0"},0,{"$f":"SUM(Table1[[#This Row],[Case Aide Hours]],Table1[[#This Row],[Case Aide Travel Time]])","v":0},{"$f":"IFERROR(IF(OR(Table1[[#This Row],[Child Support Level]]=\"Support Services Lvl 1\", Table1[[#This Row],[Child Support Level]]=\"Support Services Lvl 2\",Table1[[#This Row],[Child Support Level]]=\"Select\"),\"Case Aid Not Allowed\", PRODUCT(Table1[[#This Row],[Total Case Aide]],VLOOKUP(Table1[[#This Row],[County Where Youth Resides]],'Drop Down'!K:M,3,0))),\"0\")","v":"Case Aid Not Allowed"},"No",0,0]
["Select","-","-","-","-","DD/MM/YYYY","DD/MM/YYYY","Select","Select",{"$f":"VLOOKUP(Table1[[#This Row],[DCYF Case Region]],'Drop Down'!$F$3:$G$9,2,0)","v":"Select"},"Select","Select","Select",{"$f":"IFERROR(IF(M13=\"No\",INDEX(IndexMatch!C:C,MATCH(1,(IndexMatch!A:A=VLOOKUP(H13,'Drop Down'!K:L,2,0))*(IndexMatch!B:B=L13),0)),\"Service Already Opened\"),\"N/A\")","v":"Service Already Opened"},0,{"$f":"IF(O13>VLOOKUP(L13,'Drop Down'!$A$3:$B$10,2,0),\"1\",\"0\")","v":"0"},0,{"$f":"SUM(Table1[[#This Row],[Case Aide Hours]],Table1[[#This Row],[Case Aide Travel Time]])","v":0},{"$f":"IFERROR(IF(OR(Table1[[#This Row],[Child Support Level]]=\"Support Services Lvl 1\", Table1[[#This Row],[Child Support Level]]=\"Support Services Lvl 2\",Table1[[#This Row],[Child Support Level]]=\"Select\"),\"Case Aid Not Allowed\", PRODUCT(Table1[[#This Row],[Total Case Aide]],VLOOKUP(Table1[[#This Row],[County Where Youth Resides]],'Drop Down'!K:M,3,0))),\"0\")","v":"Case Aid Not Allowed"},"No",0,0]
["Select","-","-","-","-","DD/MM/YYYY","DD/MM/YYYY","Select","Select",{"$f":"VLOOKUP(Table1[[#This Row],[DCYF Case Region]],'Drop Down'!$F$3:$G$9,2,0)","v":"Select"},"Select","Select","Select",{"$f":"IFERROR(IF(M14=\"No\",INDEX(IndexMatch!C:C,MATCH(1,(IndexMatch!A:A=VLOOKUP(H14,'Drop Down'!K:L,2,0))*(IndexMatch!B:B=L14),0)),\"Service Already Opened\"),\"N/A\")","v":"Service Already Opened"},0,{"$f":"IF(O14>VLOOKUP(L14,'Drop Down'!$A$3:$B$10,2,0),\"1\",\"0\")","v":"0"},0,{"$f":"SUM(Table1[[#This Row],[Case Aide Hours]],Table1[[#This Row],[Case Aide Travel Time]])","v":0},{"$f":"IFERROR(IF(OR(Table1[[#This Row],[Child Support Level]]=\"Support Services Lvl 1\", Table1[[#This Row],[Child Support Level]]=\"Support Services Lvl 2\",Table1[[#This Row],[Child Support Level]]=\"Select\"),\"Case Aid Not Allowed\", PRODUCT(Table1[[#This Row],[Total Case Aide]],VLOOKUP(Table1[[#This Row],[County Where Youth Resides]],'Drop Down'!K:M,3,0))),\"0\")","v":"Case Aid Not Allowed"},"No",0,0]
["Select","-","-","-","-","DD/MM/YYYY","DD/MM/YYYY","Select","Select",{"$f":"VLOOKUP(Table1[[#This Row],[DCYF Case Region]],'Drop Down'!$F$3:$G$9,2,0)","v":"Select"},"Select","Select","Select",{"$f":"IFERROR(IF(M15=\"No\",INDEX(IndexMatch!C:C,MATCH(1,(IndexMatch!A:A=VLOOKUP(H15,'Drop Down'!K:L,2,0))*(IndexMatch!B:B=L15),0)),\"Service Already Opened\"),\"N/A\")","v":"Service Already Opened"},0,{"$f":"IF(O15>VLOOKUP(L15,'Drop Down'!$A$3:$B$10,2,0),\"1\",\"0\")","v":"0"},0,{"$f":"SUM(Table1[[#This Row],[Case Aide Hours]],Table1[[#This Row],[Case Aide Travel Time]])","v":0},{"$f":"IFERROR(IF(OR(Table1[[#This Row],[Child Support Level]]=\"Support Services Lvl 1\", Table1[[#This Row],[Child Support Level]]=\"Support Services Lvl 2\",Table1[[#This Row],[Child Support Level]]=\"Select\"),\"Case Aid Not Allowed\", PRODUCT(Table1[[#This Row],[Total Case Aide]],VLOOKUP(Table1[[#This Row],[County Where Youth Resides]],'Drop Down'!K:M,3,0))),\"0\")","v":"Case Aid Not Allowed"},"No",0,0]
{"$rows_left_out":480}
{"sheet":"Fee Table","index":2,"n_rows":45,"n_cols":14,"rows_kept":45,"cut":false,"hidden":false,"merged":[[21,9,25,9],[26,9,44,9],[37,1,48,7],[21,1,21,2],[0,1,0,13],[2,2,2,3],[2,4,2,7],[2,8,2,12]]}
[null,"CPA Contract "]
[]
[null,null,"Zone 1",null,"Zone 2",null,null,null,"Zone 3",null,null,null,null,"Zone 4"]
[null,null,"Northeast","South Central","Pacific Mountain","Southeast","Northcentral ","Central ","Southwest","Olympic","Pierce- East/West","Snohomish","Northwest","King- North/South"]
[]
[]
[null,"Support Services Lvl 1",495,495,529,529,529,529,508,508,508,508,508,564]
[null,"Support Services Lvl 2",532,532,569,569,569,569,547,547,547,547,547,607]
[null,"Support Services Lvl 3",577,577,616,616,616,616,592,592,592,592,592,657]
[null,"Support Services Lvl 4",631,631,673,673,673,673,648,648,648,648,648,718]
[null,"Support Services Lvl 5",782,782,834,834,834,834,803,803,803,803,803,890]
[null,"Support Services Lvl 6",833,833,889,889,889,889,855,855,855,855,855,948]
[null,"Support Services Lvl 7",961,961,1025,1025,1025,1025,987,987,987,987,987,1093]
[]
[]
{"$rows_left_out":31}
{"sheet":"Offices","index":3,"n_rows":123,"n_cols":20,"rows_kept":123,"cut":false,"hidden":true,"merged":[]}
["cd_dept_unit","tx_dept_unit","cd_dept_unit","tx_ofc_div",null,null,null,"Reasions",null,null,"Select"]
[772,"DJR Region 1",772,"Region 1",{"$error":"#N/A"},null,null,"[Select]",null,null,"Finished",null,null,"Select","Select","Select","Select","Select","Select","Select"]
[721,"Clarkston",721,"Region 1",5,null,null,"PCA Issue",null,null,"Not Finished",null,null,null,"Clarkston","White Salmon","Tribal Payment Only","Martin Luther King Jr. ","Parkland (Satellite)","Forks"]
[717,"Republic",717,"Region 1",7,null,null,"Insufficient Info In CLU",null,null,null,null,null,null,"Republic","Goldendale","Region 3 Adoptions"," Office of Indian Child Welfare - R04","R5 S'Klallam Tribe","Port Townsend"]
[716,"Colfax",716,"Region 1",16,null,null,"FA Error",null,null,null,null,null,null,"Colfax","Region 2 Facility Investigation","Region 3 Facility Investigation","Region 4 Family Treatment Court","Puyallup ","Olympia DCFS (Tumwater)"]
[715,"Colville",715,"Region 1",12,null,null,"Placement Correction",null,null,null,null,null,null,"Colville","Sunnyside","Sky Valley","King West DCFS","Region 5 Facility Investigation","South Bend"]
[714,"Spokane Central",714,"Region 1",9,null,null,"Provider Issue",null,null,null,null,null,null,"Spokane Central","Toppenish","Friday Harbor","King South-West","Tacoma ","Shelton"]
[713,"Omak",713,"Region 1",22,null,null,"FamLink Error",null,null,null,null,null,null,"Omak","Yakima","Oak Harbor","Region 4 Adoptions","Bremerton","Centralia"]
[712,"Moses Lake",712,"Region 1",18,null,null,"Insufficient Paperwork",null,null,null,null,null,null,"Moses Lake","Walla Walla","Smokey Point","West Seattle DCFS","Region 5 Adoptions","Aberdeen"]
[711,"Wenatchee",711,"Region 1",19,null,null,"Weekend Placement",null,null,null,null,null,null,"Wenatchee","Ellensburg DCFS","Lynnwood","King East DCFS","Lakewood","Kelso"]
[710,"Newport",710,"Region 1",10,null,null,"Respite",null,null,null,null,null,null,"Newport","Tri-Cities","Bellingham","Reg 4 AS","Vancouver - Clark","Vancouver - Cascade"]
[709,"Lincoln County (Spokane/Lincoln)",709,"Region 1",17,null,null,null,null,null,null,null,null,null,"Lincoln County (Spokane/Lincoln)","Region 2 ","Everett","King South-East","Reg 5 AS","Port Angeles"]
[708,"Region 1 Facility Investigation",708,"Region 1",{"$error":"#N/A"},null,null,null,null,null,null,null,null,null,"Region 1 Facility Investigation","Region 2 Adoptions","Mount Vernon","Martin Luther King Jr. Office","Tacoma","Long Beach"]
[701,"Region 1 ",701,"Region 1",88,null,null,null,null,null,null,null,null,null,"Region 1 ","Reg 2 AS","Bellingham","Office of Indian Child Welfare - R04","Bremerton","Stevenson"]
[695,"Spokane ICW",695,"Region 1",77,null,null,null,null,null,null,null,null,null,"Spokane ICW","Ellensburg",null,null,"Parkland","Vancouver - Columbia"]
{"$rows_left_out":109}
{"sheet":"Drop Down","index":4,"n_rows":63,"n_cols":20,"rows_kept":63,"cut":false,"hidden":true,"merged":[]}
[]
[]
["Select",0,null,"Select","Select","Select","Select","Select","Select",null,"Select",null,"Case Aide","Support Services Lvl 1","Support Services Lvl 2","Support Services Lvl 3","Support Services Lvl 4","Support Services Lvl 5","Support Services Lvl 6","Support Services Lvl 7"]
["Support Services Lvl 1",0,null,"Yes","One",1,"One",2023,"January",null,"Select","Select County",0,0,0,0,0,0,0,0]
["Support Services Lvl 2",0,null,"No","Two",2,"Two",2024,"February",null,"Lincoln","Zone 1",55.78,495,532,577,631,782,833,961]
["Support Services Lvl 3",9,null,null,"Three",3,"Three",2025,"March",null,"Klickitat","Zone 1",55.78,495,532,577,631,782,833,961]
["Support Services Lvl 4",12,null,null,"Four",4,"Four",2026,"April",null,"Pend Oreille","Zone 1",55.78,495,532,577,631,782,833,961]
["Support Services Lvl 5",15,null,null,"Five",5,"Five",2027,"May",null,"Spokane","Zone 1",55.78,495,532,577,631,782,833,961]
["Support Services Lvl 6",17,null,null,"Six",6,"Six",2028,"June",null,"Stevens","Zone 1",55.78,495,532,577,631,782,833,961]
["Support Services Lvl 7",20,null,null,null,null,null,2029,"July",null,"Yakima","Zone 1",55.78,495,532,577,631,782,833,961]
[null,null,null,null,null,null,null,2030,"August",null,"Adams","Zone 2",57.84,529,569,616,673,834,889,1025]
[null,null,null,null,null,null,null,2031,"September",null,"Asotin","Zone 2",57.84,529,569,616,673,834,889,1025]
[null,null,null,null,null,null,null,2032,"October",null,"Benton","Zone 2",57.84,529,569,616,673,834,889,1025]
[null,null,null,null,null,null,null,2033,"November",null,"Chelan","Zone 2",57.84,529,569,616,673,834,889,1025]
[null,null,null,null,null,null,null,2034,"December",null,"Columbia","Zone 2",57.84,529,569,616,673,834,889,1025]
{"$rows_left_out":49}
{"sheet":"IndexMatch","index":5,"n_rows":35,"n_cols":3,"rows_kept":35,"cut":false,"hidden":true,"merged":[]}
["Select","Support Services Lvl 1",0]
["Select","Support Services Lvl 2",0]
["Select","Support Services Lvl 3",0]
["Select","Support Services Lvl 4",0]
["Select","Support Services Lvl 5",0]
["Select","Support Services Lvl 6",0]
["Select","Support Services Lvl 7",0]
["Zone 1","Support Services Lvl 1",495]
["Zone 1","Support Services Lvl 2",532]
["Zone 1","Support Services Lvl 3",577]
["Zone 1","Support Services Lvl 4",631]
["Zone 1","Support Services Lvl 5",782]
["Zone 1","Support Services Lvl 6",833]
["Zone 1","Support Services Lvl 7",961]
["Zone 2","Support Services Lvl 1",529]
{"$rows_left_out":20}