{"text_format":"1","workbook":"xlsx","n_sheets":6,"sheets":["Roll Up","Roster","Fee Table","Offices","Drop Down","IndexMatch"],"not_rendered":{"charts":0,"images":0,"macros":0,"external_links":0,"defined_names":9,"comments":0,"pivot_tables":0},"unopened":[],"bounds":{"document_bytes":16777216,"sheet_cells":100000,"rows_first":2000,"rows_last":500,"rows_between":2000,"halvings":0,"cell_chars":16384,"cell_head_chars":4096},"cells_cut":0,"cells_raw":0,"read":"whole","date_system":"1900"}

{"sheet":"Roll Up","index":0,"n_rows":98,"n_cols":10,"rows_kept":98,"cut":false,"hidden":false,"merged":[[39,4,39,6],[40,4,40,6],[0,2,0,9],[1,2,1,9],[2,2,2,8],[9,1,9,10],[5,4,5,8],[30,4,30,6],[18,9,19,10],[18,8,19,8],[21,4,21,6],[36,8,37,8],[12,2,15,10],[18,2,19,6],[27,2,28,6],[36,2,37,6],[41,4,41,6],[45,8,46,8],[45,2,46,6],[83,1,85,9],[50,4,50,6],[54,9,55,10],[45,9,46,10],[48,4,48,6],[49,4,49,6],[54,2,55,6],[57,4,57,6],[58,4,58,6],[59,4,59,6],[54,8,55,8],[91,9,93,9],[92,1,93,5],[63,2,64,6],[77,4,77,6],[75,4,75,6],[76,4,76,6],[72,2,73,2],[72,8,73,8],[72,9,73,10],[66,4,66,6],[67,4,67,6],[68,4,68,6],[63,8,64,8],[63,9,64,10],[89,1,90,8],[36,9,37,10],[27,8,28,8],[27,9,28,10],[22,4,22,6],[23,4,23,6],[31,4,31,6],[32,4,32,6]]}
[null,null,"WASHINGTON STATE DEPARTMENT OF CHILDREN, YOUTH, AND FAMILIES"]
[null,null,"CPA Billing Form"]
[]
[null,null,"Month of Service:",null,"Select",null,"Year:",null,"Select"]
[]
[null,null,"Provider Name:"]
[]
[null,null,"FamLink Provider #:",null,null,null,"Contract #:"]
[]
[null,"Please Complete the \"Roster\" Tab"]
[]
[]
[null,null,"- This Billing Form is Meant to provide a monthly invoice for case aide.\n- Provider Resource Support Levels will be opened independently without the need for paperwork; however, this form allows for the CPA to note which cases have not received an invoice for Provider Resource Support to reduce delays in payment."]
[]
[]
[]
[]
[]
[null,null,"Region 1: Mileage is Paid Lump Sum",null,null,null,null,null,"Dollar Amounts","Count"]
[]
[]
[null,null,"One",null,"Provider Resource Support",null,null,null,"-",{"$f":"COUNTIFS(Roster!$J:$J,'Roll Up'!C22,Roster!$M:$M,\"No\")","v":0}]
[null,null,null,null,"Case Aide",null,null,null,{"$f":"SUMIFS(Roster!$S:$S,Roster!$J:$J,$C$22)","v":0},{"$f":"COUNTIFS(Roster!$J:$J,'Roll Up'!C22,Roster!$O:$O,\">0\")","v":0}]
[null,null,null,null,"Mileage",null,null,null,{"$f":"SUMIFS(Roster!$V:$V,Roster!$J:$J,$C$22)","v":0},{"$f":"COUNTIFS(Roster!$J:$J,'Roll Up'!C22,Roster!$U:$U,\">0\")","v":0}]
[null,null,null,null,null,null,"Total:",null,{"$f":"SUM(I22:I24)","v":0},{"$f":"SUM(J22:J24)","v":0}]
[]
[]
[null,null,"Region 2: Mileage is Paid Lump Sum",null,null,null,null,null,"Dollar Amounts","Count"]
[null,null,"Region 2",null,null,null,null,null,"Dollar Amounts","Count"]
[]
[null,null,"Two",null,"Provider Resource Support",null,null,null,"-",{"$f":"COUNTIFS(Roster!$J:$J,'Roll Up'!C31,Roster!$M:$M,\"No\")","v":0}]
[null,null,null,null,"Case Aide",null,null,null,{"$f":"SUMIFS(Roster!S:S,Roster!$J:$J,$C$31)","v":0},{"$f":"COUNTIFS(Roster!$J:$J,'Roll Up'!C31,Roster!$O:$O,\">0\")","v":0}]
[null,null,null,null,"Mileage",null,null,null,{"$f":"SUMIFS(Roster!$V:$V,Roster!$J:$J,$C$31)","v":0},{"$f":"COUNTIFS(Roster!$J:$J,'Roll Up'!C31,Roster!$U:$U,\">0\")","v":0}]
[null,null,null,null,null,null,"Total:",null,{"$f":"SUM(I31:I33)","v":0},{"$f":"SUM(J31:J33)","v":0}]
[]
[]
[null,null,"Region 3: Mileage is Paid Lump Sum",null,null,null,null,null,"Dollar Amounts","Count"]
[null,null,"Region 3",null,null,null,null,null,"Dollar Amounts","Count"]
[]
[null,null,"Three",null,"Provider Resource Support",null,null,null,"-",{"$f":"COUNTIFS(Roster!$J:$J,'Roll Up'!C40,Roster!$M:$M,\"No\")","v":0}]
[null,null,null,null,"Case Aide",null,null,null,{"$f":"SUMIFS(Roster!$S:$S,Roster!$J:$J,$C$40)","v":0},{"$f":"COUNTIFS(Roster!$J:$J,'Roll Up'!C40,Roster!$O:$O,\">0\")","v":0}]
[null,null,null,null,"Mileage",null,null,null,{"$f":"SUMIFS(Roster!$V:$V,Roster!$J:$J,$C$40)","v":0},{"$f":"COUNTIFS(Roster!$J:$J,'Roll Up'!C40,Roster!$U:$U,\">0\")","v":0}]
[null,null,null,null,null,null,"Total:",null,{"$f":"SUM(I40:I42)","v":0},{"$f":"SUM(J40:J42)","v":0}]
[]
[]
[null,null,"Region 4: Mileage is Paid Lump Sum",null,null,null,null,null,"Dollar Amounts","Count"]
[null,null,"Region 4",null,null,null,null,null,"Dollar Amounts","Count"]
[]
[null,null,"Four",null,"Provider Resource Support",null,null,null,"-",{"$f":"COUNTIFS(Roster!$J:$J,'Roll Up'!C49,Roster!$M:$M,\"No\")","v":0}]
[null,null,null,null,"Case Aide",null,null,null,{"$f":"SUMIFS(Roster!$S:$S,Roster!$J:$J,$C$49)","v":0},{"$f":"COUNTIFS(Roster!$J:$J,'Roll Up'!C49,Roster!$O:$O,\">0\")","v":0}]
[null,null,null,null,"Mileage",null,null,null,{"$f":"SUMIFS(Roster!$V:$V,Roster!$J:$J,$C$49)","v":0},{"$f":"COUNTIFS(Roster!$J:$J,'Roll Up'!C49,Roster!$U:$U,\">0\")","v":0}]
[null,null,null,null,null,null,"Total:",null,{"$f":"SUM(I49:I51)","v":0},{"$f":"SUM(J49:J51)","v":0}]
[]
[]
[null,null,"Region 5: Mileage is Paid Lump Sum",null,null,null,null,null,"Dollar Amounts","Count"]
[null,null,"Region 5",null,null,null,null,null,"Dollar Amounts","Count"]
[]
[null,null,"Five",null,"Provider Resource Support",null,null,null,"-",{"$f":"COUNTIFS(Roster!$J:$J,'Roll Up'!C58,Roster!$M:$M,\"No\")","v":0}]
[null,null,null,null,"Case Aide",null,null,null,{"$f":"SUMIFS(Roster!$S:$S,Roster!$J:$J,$C$58)","v":0},{"$f":"COUNTIFS(Roster!$J:$J,'Roll Up'!C58,Roster!$O:$O,\">0\")","v":0}]
[null,null,null,null,"Mileage",null,null,null,{"$f":"SUMIFS(Roster!$V:$V,Roster!$J:$J,$C$58)","v":0},{"$f":"COUNTIFS(Roster!$J:$J,'Roll Up'!C58,Roster!$U:$U,\">0\")","v":0}]
[null,null,null,null,null,null,"Total:",null,{"$f":"SUM(I58:I60)","v":0},{"$f":"SUM(J58:J60)","v":0}]
[]
[]
[null,null,"Region 6: Mileage is Paid Lump Sum",null,null,null,null,null,"Dollar Amounts","Count"]
[null,null,"Region 6",null,null,null,null,null,"Dollar Amounts","Count"]
[]
[null,null,"Six",null,"Provider Resource Support",null,null,null,"-",{"$f":"COUNTIFS(Roster!$J:$J,'Roll Up'!C67,Roster!$M:$M,\"No\")","v":0}]
[null,null,null,null,"Case Aide",null,null,null,{"$f":"SUMIFS(Roster!$S:$S,Roster!$J:$J,$C$67)","v":0},{"$f":"COUNTIFS(Roster!$J:$J,'Roll Up'!C67,Roster!$O:$O,\">0\")","v":0}]
[null,null,null,null,"Mileage",null,null,null,{"$f":"SUMIFS(Roster!$V:$V,Roster!$J:$J,$C$67)","v":0},{"$f":"COUNTIFS(Roster!$J:$J,'Roll Up'!C67,Roster!$U:$U,\">0\")","v":0}]
[null,null,null,null,null,null,"Total:",null,{"$f":"SUM(I67:I69)","v":0},{"$f":"SUM(J67:J69)","v":0}]
[]
[]
[null,null,"State-Wide",null,null,null,null,null,"Dollar Amounts","Count"]
[null,null,"Region 6",null,null,null,null,null,"Dollar Amounts","Count"]
[]
[null,null,null,null,"Provider Resource Support",null,null,null,"-",{"$f":"SUM(J67,J58,J49,J40,J31,J22)","v":0}]
[null,null,null,null,"Case Aide",null,null,null,0,0]
[null,null,null,null,"Mileage",null,null,null,0,0]
[null,null,null,null,null,null,"Total:",null,{"$f":"SUM(I76:I78)","v":0},{"$f":"SUM(J76:J78)","v":0}]
[]
[]
[]
[null,"Comments"]
[]
[]
[]
[]
[null,"Provider's Certification"]
[]
[null,"I hereby certify under penalty of perjury that the invoice above are correct and are proper charges for services furnished to the State of Washington DCYF."]
[]
[]
[]
[]
[null,"Provider Authorized Signature",null,null,null,null,null,null,null,"Date"]
[]
[null,"FAMLINK INVOICE FORM (2/05/2024)"]
[null,"Created by the Fiscal Integrity Unit"]

{"sheet":"Roster","index":1,"n_rows":494,"n_cols":22,"rows_kept":494,"cut":false,"hidden":false,"merged":[]}
["Month of Service","Child Name","Child ID","Case Name","Case Number","Service Start Date","Service End Date","County Where Youth Resides","DCYF Case Region","Hidden Region Column","DCYF Case Office","Child Support Level","Has Payment Been Opened for Provider Resource Support","Provider Resource Support Due","Case Aide Hours","Hide Column","Case Aide Travel Time","Total Case Aide","Case Aide Due","AAR Required","Mileage","Mileage Due (Paid by Lump Sum)"]
["Select","-","-","-","-","DD/MM/YYYY","DD/MM/YYYY","Select","Select",{"$f":"VLOOKUP(Table1[[#This Row],[DCYF Case Region]],'Drop Down'!$F$3:$G$9,2,0)","v":"Select"},"Select","Select","Select",{"$f":"IFERROR(IF(M2=\"No\",INDEX(IndexMatch!C:C,MATCH(1,(IndexMatch!A:A=VLOOKUP(H2,'Drop Down'!K:L,2,0))*(IndexMatch!B:B=L2),0)),\"Service Already Opened\"),\"N/A\")","v":"Service Already Opened"},0,{"$f":"IF(O2>VLOOKUP(L2,'Drop Down'!$A$3:$B$10,2,0),\"1\",\"0\")","v":"0"},0,{"$f":"SUM(Table1[[#This Row],[Case Aide Hours]],Table1[[#This Row],[Case Aide Travel Time]])","v":0},{"$f":"IFERROR(IF(OR(Table1[[#This Row],[Child Support Level]]=\"Support Services Lvl 1\", Table1[[#This Row],[Child Support Level]]=\"Support Services Lvl 2\",Table1[[#This Row],[Child Support Level]]=\"Select\"),\"Case Aid Not Allowed\", PRODUCT(Table1[[#This Row],[Total Case Aide]],VLOOKUP(Table1[[#This Row],[County Where Youth Resides]],'Drop Down'!K:M,3,0))),\"0\")","v":"Case Aid Not Allowed"},{"$f":"IF(P2=\"1\",\"Yes\",\"No\")","v":"No"},0,{"$f":"ROUND(PRODUCT(U2,0.67),2)","v":0}]
["Select","-","-","-","-","DD/MM/YYYY","DD/MM/YYYY","Select","Select",{"$f":"VLOOKUP(Table1[[#This Row],[DCYF Case Region]],'Drop Down'!$F$3:$G$9,2,0)","v":"Select"},"Select","Select","Select",{"$f":"IFERROR(IF(M3=\"No\",INDEX(IndexMatch!C:C,MATCH(1,(IndexMatch!A:A=VLOOKUP(H3,'Drop Down'!K:L,2,0))*(IndexMatch!B:B=L3),0)),\"Service Already Opened\"),\"N/A\")","v":"Service Already Opened"},0,{"$f":"IF(O3>VLOOKUP(L3,'Drop Down'!$A$3:$B$10,2,0),\"1\",\"0\")","v":"0"},0,{"$f":"SUM(Table1[[#This Row],[Case Aide Hours]],Table1[[#This Row],[Case Aide Travel Time]])","v":0},{"$f":"IFERROR(IF(OR(Table1[[#This Row],[Child Support Level]]=\"Support Services Lvl 1\", Table1[[#This Row],[Child Support Level]]=\"Support Services Lvl 2\",Table1[[#This Row],[Child Support Level]]=\"Select\"),\"Case Aid Not Allowed\", PRODUCT(Table1[[#This Row],[Total Case Aide]],VLOOKUP(Table1[[#This Row],[County Where Youth Resides]],'Drop Down'!K:M,3,0))),\"0\")","v":"Case Aid Not Allowed"},{"$f":"IF(P3=\"1\",\"Yes\",\"No\")","v":"No"},0,0]
["Select","-","-","-","-","DD/MM/YYYY","DD/MM/YYYY","Select","Select",{"$f":"VLOOKUP(Table1[[#This Row],[DCYF Case Region]],'Drop Down'!$F$3:$G$9,2,0)","v":"Select"},"Select","Select","Select",{"$f":"IFERROR(IF(M4=\"No\",INDEX(IndexMatch!C:C,MATCH(1,(IndexMatch!A:A=VLOOKUP(H4,'Drop Down'!K:L,2,0))*(IndexMatch!B:B=L4),0)),\"Service Already Opened\"),\"N/A\")","v":"Service Already Opened"},0,{"$f":"IF(O4>VLOOKUP(L4,'Drop Down'!$A$3:$B$10,2,0),\"1\",\"0\")","v":"0"},0,{"$f":"SUM(Table1[[#This Row],[Case Aide Hours]],Table1[[#This Row],[Case Aide Travel Time]])","v":0},{"$f":"IFERROR(IF(OR(Table1[[#This Row],[Child Support Level]]=\"Support Services Lvl 1\", Table1[[#This Row],[Child Support Level]]=\"Support Services Lvl 2\",Table1[[#This Row],[Child Support Level]]=\"Select\"),\"Case Aid Not Allowed\", PRODUCT(Table1[[#This Row],[Total Case Aide]],VLOOKUP(Table1[[#This Row],[County Where Youth Resides]],'Drop Down'!K:M,3,0))),\"0\")","v":"Case Aid Not Allowed"},"No",0,0]
["Select","-","-","-","-","DD/MM/YYYY","DD/MM/YYYY","Select","Select",{"$f":"VLOOKUP(Table1[[#This Row],[DCYF Case Region]],'Drop Down'!$F$3:$G$9,2,0)","v":"Select"},"Select","Select","Select",{"$f":"IFERROR(IF(M5=\"No\",INDEX(IndexMatch!C:C,MATCH(1,(IndexMatch!A:A=VLOOKUP(H5,'Drop Down'!K:L,2,0))*(IndexMatch!B:B=L5),0)),\"Service Already Opened\"),\"N/A\")","v":"Service Already Opened"},0,{"$f":"IF(O5>VLOOKUP(L5,'Drop Down'!$A$3:$B$10,2,0),\"1\",\"0\")","v":"0"},0,{"$f":"SUM(Table1[[#This Row],[Case Aide Hours]],Table1[[#This Row],[Case Aide Travel Time]])","v":0},{"$f":"IFERROR(IF(OR(Table1[[#This Row],[Child Support Level]]=\"Support Services Lvl 1\", Table1[[#This Row],[Child Support Level]]=\"Support Services Lvl 2\",Table1[[#This Row],[Child Support Level]]=\"Select\"),\"Case Aid Not Allowed\", PRODUCT(Table1[[#This Row],[Total Case Aide]],VLOOKUP(Table1[[#This Row],[County Where Youth Resides]],'Drop Down'!K:M,3,0))),\"0\")","v":"Case Aid Not Allowed"},"No",0,0]
["Select","-","-","-","-","DD/MM/YYYY","DD/MM/YYYY","Select","Select",{"$f":"VLOOKUP(Table1[[#This Row],[DCYF Case Region]],'Drop Down'!$F$3:$G$9,2,0)","v":"Select"},"Select","Select","Select",{"$f":"IFERROR(IF(M6=\"No\",INDEX(IndexMatch!C:C,MATCH(1,(IndexMatch!A:A=VLOOKUP(H6,'Drop Down'!K:L,2,0))*(IndexMatch!B:B=L6),0)),\"Service Already Opened\"),\"N/A\")","v":"Service Already Opened"},0,{"$f":"IF(O6>VLOOKUP(L6,'Drop Down'!$A$3:$B$10,2,0),\"1\",\"0\")","v":"0"},0,{"$f":"SUM(Table1[[#This Row],[Case Aide Hours]],Table1[[#This Row],[Case Aide Travel Time]])","v":0},{"$f":"IFERROR(IF(OR(Table1[[#This Row],[Child Support Level]]=\"Support Services Lvl 1\", Table1[[#This Row],[Child Support Level]]=\"Support Services Lvl 2\",Table1[[#This Row],[Child Support Level]]=\"Select\"),\"Case Aid Not Allowed\", PRODUCT(Table1[[#This Row],[Total Case Aide]],VLOOKUP(Table1[[#This Row],[County Where Youth Resides]],'Drop Down'!K:M,3,0))),\"0\")","v":"Case Aid Not Allowed"},"No",0,0]
["Select","-","-","-","-","DD/MM/YYYY","DD/MM/YYYY","Select","Select",{"$f":"VLOOKUP(Table1[[#This Row],[DCYF Case Region]],'Drop Down'!$F$3:$G$9,2,0)","v":"Select"},"Select","Select","Select",{"$f":"IFERROR(IF(M7=\"No\",INDEX(IndexMatch!C:C,MATCH(1,(IndexMatch!A:A=VLOOKUP(H7,'Drop Down'!K:L,2,0))*(IndexMatch!B:B=L7),0)),\"Service Already Opened\"),\"N/A\")","v":"Service Already Opened"},0,{"$f":"IF(O7>VLOOKUP(L7,'Drop Down'!$A$3:$B$10,2,0),\"1\",\"0\")","v":"0"},0,{"$f":"SUM(Table1[[#This Row],[Case Aide Hours]],Table1[[#This Row],[Case Aide Travel Time]])","v":0},{"$f":"IFERROR(IF(OR(Table1[[#This Row],[Child Support Level]]=\"Support Services Lvl 1\", Table1[[#This Row],[Child Support Level]]=\"Support Services Lvl 2\",Table1[[#This Row],[Child Support Level]]=\"Select\"),\"Case Aid Not Allowed\", PRODUCT(Table1[[#This Row],[Total Case Aide]],VLOOKUP(Table1[[#This Row],[County Where Youth Resides]],'Drop Down'!K:M,3,0))),\"0\")","v":"Case Aid Not Allowed"},"No",0,0]
["Select","-","-","-","-","DD/MM/YYYY","DD/MM/YYYY","Select","Select",{"$f":"VLOOKUP(Table1[[#This Row],[DCYF Case Region]],'Drop Down'!$F$3:$G$9,2,0)","v":"Select"},"Select","Select","Select",{"$f":"IFERROR(IF(M8=\"No\",INDEX(IndexMatch!C:C,MATCH(1,(IndexMatch!A:A=VLOOKUP(H8,'Drop Down'!K:L,2,0))*(IndexMatch!B:B=L8),0)),\"Service Already Opened\"),\"N/A\")","v":"Service Already Opened"},0,{"$f":"IF(O8>VLOOKUP(L8,'Drop Down'!$A$3:$B$10,2,0),\"1\",\"0\")","v":"0"},0,{"$f":"SUM(Table1[[#This Row],[Case Aide Hours]],Table1[[#This Row],[Case Aide Travel Time]])","v":0},{"$f":"IFERROR(IF(OR(Table1[[#This Row],[Child Support Level]]=\"Support Services Lvl 1\", Table1[[#This Row],[Child Support Level]]=\"Support Services Lvl 2\",Table1[[#This Row],[Child Support Level]]=\"Select\"),\"Case Aid Not Allowed\", PRODUCT(Table1[[#This Row],[Total Case Aide]],VLOOKUP(Table1[[#This Row],[County Where Youth Resides]],'Drop Down'!K:M,3,0))),\"0\")","v":"Case Aid Not Allowed"},"No",0,0]
["Select","-","-","-","-","DD/MM/YYYY","DD/MM/YYYY","Select","Select",{"$f":"VLOOKUP(Table1[[#This Row],[DCYF Case Region]],'Drop Down'!$F$3:$G$9,2,0)","v":"Select"},"Select","Select","Select",{"$f":"IFERROR(IF(M9=\"No\",INDEX(IndexMatch!C:C,MATCH(1,(IndexMatch!A:A=VLOOKUP(H9,'Drop Down'!K:L,2,0))*(IndexMatch!B:B=L9),0)),\"Service Already Opened\"),\"N/A\")","v":"Service Already Opened"},0,{"$f":"IF(O9>VLOOKUP(L9,'Drop Down'!$A$3:$B$10,2,0),\"1\",\"0\")","v":"0"},0,{"$f":"SUM(Table1[[#This Row],[Case Aide Hours]],Table1[[#This Row],[Case Aide Travel Time]])","v":0},{"$f":"IFERROR(IF(OR(Table1[[#This Row],[Child Support Level]]=\"Support Services Lvl 1\", Table1[[#This Row],[Child Support Level]]=\"Support Services Lvl 2\",Table1[[#This Row],[Child Support Level]]=\"Select\"),\"Case Aid Not Allowed\", PRODUCT(Table1[[#This Row],[Total Case Aide]],VLOOKUP(Table1[[#This Row],[County Where Youth Resides]],'Drop Down'!K:M,3,0))),\"0\")","v":"Case Aid Not Allowed"},"No",0,0]
["Select","-","-","-","-","DD/MM/YYYY","DD/MM/YYYY","Select","Select",{"$f":"VLOOKUP(Table1[[#This Row],[DCYF Case Region]],'Drop Down'!$F$3:$G$9,2,0)","v":"Select"},"Select","Select","Select",{"$f":"IFERROR(IF(M10=\"No\",INDEX(IndexMatch!C:C,MATCH(1,(IndexMatch!A:A=VLOOKUP(H10,'Drop Down'!K:L,2,0))*(IndexMatch!B:B=L10),0)),\"Service Already Opened\"),\"N/A\")","v":"Service Already Opened"},0,{"$f":"IF(O10>VLOOKUP(L10,'Drop Down'!$A$3:$B$10,2,0),\"1\",\"0\")","v":"0"},0,{"$f":"SUM(Table1[[#This Row],[Case Aide Hours]],Table1[[#This Row],[Case Aide Travel Time]])","v":0},{"$f":"IFERROR(IF(OR(Table1[[#This Row],[Child Support Level]]=\"Support Services Lvl 1\", Table1[[#This Row],[Child Support Level]]=\"Support Services Lvl 2\",Table1[[#This Row],[Child Support Level]]=\"Select\"),\"Case Aid Not Allowed\", PRODUCT(Table1[[#This Row],[Total Case Aide]],VLOOKUP(Table1[[#This Row],[County Where Youth Resides]],'Drop Down'!K:M,3,0))),\"0\")","v":"Case Aid Not Allowed"},"No",0,0]
["Select","-","-","-","-","DD/MM/YYYY","DD/MM/YYYY","Select","Select",{"$f":"VLOOKUP(Table1[[#This Row],[DCYF Case Region]],'Drop Down'!$F$3:$G$9,2,0)","v":"Select"},"Select","Select","Select",{"$f":"IFERROR(IF(M11=\"No\",INDEX(IndexMatch!C:C,MATCH(1,(IndexMatch!A:A=VLOOKUP(H11,'Drop Down'!K:L,2,0))*(IndexMatch!B:B=L11),0)),\"Service Already Opened\"),\"N/A\")","v":"Service Already Opened"},0,{"$f":"IF(O11>VLOOKUP(L11,'Drop Down'!$A$3:$B$10,2,0),\"1\",\"0\")","v":"0"},0,{"$f":"SUM(Table1[[#This Row],[Case Aide Hours]],Table1[[#This Row],[Case Aide Travel Time]])","v":0},{"$f":"IFERROR(IF(OR(Table1[[#This Row],[Child Support Level]]=\"Support Services Lvl 1\", Table1[[#This Row],[Child Support Level]]=\"Support Services Lvl 2\",Table1[[#This Row],[Child Support Level]]=\"Select\"),\"Case Aid Not Allowed\", PRODUCT(Table1[[#This Row],[Total Case Aide]],VLOOKUP(Table1[[#This Row],[County Where Youth Resides]],'Drop Down'!K:M,3,0))),\"0\")","v":"Case Aid Not Allowed"},"No",0,0]
["Select","-","-","-","-","DD/MM/YYYY","DD/MM/YYYY","Select","Select",{"$f":"VLOOKUP(Table1[[#This Row],[DCYF Case Region]],'Drop Down'!$F$3:$G$9,2,0)","v":"Select"},"Select","Select","Select",{"$f":"IFERROR(IF(M12=\"No\",INDEX(IndexMatch!C:C,MATCH(1,(IndexMatch!A:A=VLOOKUP(H12,'Drop Down'!K:L,2,0))*(IndexMatch!B:B=L12),0)),\"Service Already Opened\"),\"N/A\")","v":"Service Already Opened"},0,{"$f":"IF(O12>VLOOKUP(L12,'Drop Down'!$A$3:$B$10,2,0),\"1\",\"0\")","v":"0"},0,{"$f":"SUM(Table1[[#This Row],[Case Aide Hours]],Table1[[#This Row],[Case Aide Travel Time]])","v":0},{"$f":"IFERROR(IF(OR(Table1[[#This Row],[Child Support Level]]=\"Support Services Lvl 1\", Table1[[#This Row],[Child Support Level]]=\"Support Services Lvl 2\",Table1[[#This Row],[Child Support Level]]=\"Select\"),\"Case Aid Not Allowed\", PRODUCT(Table1[[#This Row],[Total Case Aide]],VLOOKUP(Table1[[#This Row],[County Where Youth Resides]],'Drop Down'!K:M,3,0))),\"0\")","v":"Case Aid Not Allowed"},"No",0,0]
["Select","-","-","-","-","DD/MM/YYYY","DD/MM/YYYY","Select","Select",{"$f":"VLOOKUP(Table1[[#This Row],[DCYF Case Region]],'Drop Down'!$F$3:$G$9,2,0)","v":"Select"},"Select","Select","Select",{"$f":"IFERROR(IF(M13=\"No\",INDEX(IndexMatch!C:C,MATCH(1,(IndexMatch!A:A=VLOOKUP(H13,'Drop Down'!K:L,2,0))*(IndexMatch!B:B=L13),0)),\"Service Already Opened\"),\"N/A\")","v":"Service Already Opened"},0,{"$f":"IF(O13>VLOOKUP(L13,'Drop Down'!$A$3:$B$10,2,0),\"1\",\"0\")","v":"0"},0,{"$f":"SUM(Table1[[#This Row],[Case Aide Hours]],Table1[[#This Row],[Case Aide Travel Time]])","v":0},{"$f":"IFERROR(IF(OR(Table1[[#This Row],[Child Support Level]]=\"Support Services Lvl 1\", Table1[[#This Row],[Child Support Level]]=\"Support Services Lvl 2\",Table1[[#This Row],[Child Support Level]]=\"Select\"),\"Case Aid Not Allowed\", PRODUCT(Table1[[#This Row],[Total Case Aide]],VLOOKUP(Table1[[#This Row],[County Where Youth Resides]],'Drop Down'!K:M,3,0))),\"0\")","v":"Case Aid Not Allowed"},"No",0,0]
["Select","-","-","-","-","DD/MM/YYYY","DD/MM/YYYY","Select","Select",{"$f":"VLOOKUP(Table1[[#This Row],[DCYF Case Region]],'Drop Down'!$F$3:$G$9,2,0)","v":"Select"},"Select","Select","Select",{"$f":"IFERROR(IF(M14=\"No\",INDEX(IndexMatch!C:C,MATCH(1,(IndexMatch!A:A=VLOOKUP(H14,'Drop Down'!K:L,2,0))*(IndexMatch!B:B=L14),0)),\"Service Already Opened\"),\"N/A\")","v":"Service Already Opened"},0,{"$f":"IF(O14>VLOOKUP(L14,'Drop Down'!$A$3:$B$10,2,0),\"1\",\"0\")","v":"0"},0,{"$f":"SUM(Table1[[#This Row],[Case Aide Hours]],Table1[[#This Row],[Case Aide Travel Time]])","v":0},{"$f":"IFERROR(IF(OR(Table1[[#This Row],[Child Support Level]]=\"Support Services Lvl 1\", Table1[[#This Row],[Child Support Level]]=\"Support Services Lvl 2\",Table1[[#This Row],[Child Support Level]]=\"Select\"),\"Case Aid Not Allowed\", PRODUCT(Table1[[#This Row],[Total Case Aide]],VLOOKUP(Table1[[#This Row],[County Where Youth Resides]],'Drop Down'!K:M,3,0))),\"0\")","v":"Case Aid Not Allowed"},"No",0,0]
["Select","-","-","-","-","DD/MM/YYYY","DD/MM/YYYY","Select","Select",{"$f":"VLOOKUP(Table1[[#This Row],[DCYF Case Region]],'Drop Down'!$F$3:$G$9,2,0)","v":"Select"},"Select","Select","Select",{"$f":"IFERROR(IF(M15=\"No\",INDEX(IndexMatch!C:C,MATCH(1,(IndexMatch!A:A=VLOOKUP(H15,'Drop Down'!K:L,2,0))*(IndexMatch!B:B=L15),0)),\"Service Already Opened\"),\"N/A\")","v":"Service Already Opened"},0,{"$f":"IF(O15>VLOOKUP(L15,'Drop Down'!$A$3:$B$10,2,0),\"1\",\"0\")","v":"0"},0,{"$f":"SUM(Table1[[#This Row],[Case Aide Hours]],Table1[[#This Row],[Case Aide Travel Time]])","v":0},{"$f":"IFERROR(IF(OR(Table1[[#This Row],[Child Support Level]]=\"Support Services Lvl 1\", Table1[[#This Row],[Child Support Level]]=\"Support Services Lvl 2\",Table1[[#This Row],[Child Support Level]]=\"Select\"),\"Case Aid Not Allowed\", PRODUCT(Table1[[#This Row],[Total Case Aide]],VLOOKUP(Table1[[#This Row],[County Where Youth Resides]],'Drop Down'!K:M,3,0))),\"0\")","v":"Case Aid Not Allowed"},"No",0,0]
["Select","-","-","-","-","DD/MM/YYYY","DD/MM/YYYY","Select","Select",{"$f":"VLOOKUP(Table1[[#This Row],[DCYF Case Region]],'Drop Down'!$F$3:$G$9,2,0)","v":"Select"},"Select","Select","Select",{"$f":"IFERROR(IF(M16=\"No\",INDEX(IndexMatch!C:C,MATCH(1,(IndexMatch!A:A=VLOOKUP(H16,'Drop Down'!K:L,2,0))*(IndexMatch!B:B=L16),0)),\"Service Already Opened\"),\"N/A\")","v":"Service Already Opened"},0,{"$f":"IF(O16>VLOOKUP(L16,'Drop Down'!$A$3:$B$10,2,0),\"1\",\"0\")","v":"0"},0,{"$f":"SUM(Table1[[#This Row],[Case Aide Hours]],Table1[[#This Row],[Case Aide Travel Time]])","v":0},{"$f":"IFERROR(IF(OR(Table1[[#This Row],[Child Support Level]]=\"Support Services Lvl 1\", Table1[[#This Row],[Child Support Level]]=\"Support Services Lvl 2\",Table1[[#This Row],[Child Support Level]]=\"Select\"),\"Case Aid Not Allowed\", PRODUCT(Table1[[#This Row],[Total Case Aide]],VLOOKUP(Table1[[#This Row],[County Where Youth Resides]],'Drop Down'!K:M,3,0))),\"0\")","v":"Case Aid Not Allowed"},"No",0,0]
["Select","-","-","-","-","DD/MM/YYYY","DD/MM/YYYY","Select","Select",{"$f":"VLOOKUP(Table1[[#This Row],[DCYF Case Region]],'Drop Down'!$F$3:$G$9,2,0)","v":"Select"},"Select","Select","Select",{"$f":"IFERROR(IF(M17=\"No\",INDEX(IndexMatch!C:C,MATCH(1,(IndexMatch!A:A=VLOOKUP(H17,'Drop Down'!K:L,2,0))*(IndexMatch!B:B=L17),0)),\"Service Already Opened\"),\"N/A\")","v":"Service Already Opened"},0,{"$f":"IF(O17>VLOOKUP(L17,'Drop Down'!$A$3:$B$10,2,0),\"1\",\"0\")","v":"0"},0,{"$f":"SUM(Table1[[#This Row],[Case Aide Hours]],Table1[[#This Row],[Case Aide Travel Time]])","v":0},{"$f":"IFERROR(IF(OR(Table1[[#This Row],[Child Support Level]]=\"Support Services Lvl 1\", Table1[[#This Row],[Child Support Level]]=\"Support Services Lvl 2\",Table1[[#This Row],[Child Support Level]]=\"Select\"),\"Case Aid Not Allowed\", PRODUCT(Table1[[#This Row],[Total Case Aide]],VLOOKUP(Table1[[#This Row],[County Where Youth Resides]],'Drop Down'!K:M,3,0))),\"0\")","v":"Case Aid Not Allowed"},"No",0,0]
["Select","-","-","-","-","DD/MM/YYYY","DD/MM/YYYY","Select","Select",{"$f":"VLOOKUP(Table1[[#This Row],[DCYF Case Region]],'Drop Down'!$F$3:$G$9,2,0)","v":"Select"},"Select","Select","Select",{"$f":"IFERROR(IF(M18=\"No\",INDEX(IndexMatch!C:C,MATCH(1,(IndexMatch!A:A=VLOOKUP(H18,'Drop Down'!K:L,2,0))*(IndexMatch!B:B=L18),0)),\"Service Already Opened\"),\"N/A\")","v":"Service Already Opened"},0,{"$f":"IF(O18>VLOOKUP(L18,'Drop Down'!$A$3:$B$10,2,0),\"1\",\"0\")","v":"0"},0,{"$f":"SUM(Table1[[#This Row],[Case Aide Hours]],Table1[[#This Row],[Case Aide Travel Time]])","v":0},{"$f":"IFERROR(IF(OR(Table1[[#This Row],[Child Support Level]]=\"Support Services Lvl 1\", Table1[[#This Row],[Child Support Level]]=\"Support Services Lvl 2\",Table1[[#This Row],[Child Support Level]]=\"Select\"),\"Case Aid Not Allowed\", PRODUCT(Table1[[#This Row],[Total Case Aide]],VLOOKUP(Table1[[#This Row],[County Where Youth Resides]],'Drop Down'!K:M,3,0))),\"0\")","v":"Case Aid Not Allowed"},"No",0,0]
["Select","-","-","-","-","DD/MM/YYYY","DD/MM/YYYY","Select","Select",{"$f":"VLOOKUP(Table1[[#This Row],[DCYF Case Region]],'Drop Down'!$F$3:$G$9,2,0)","v":"Select"},"Select","Select","Select",{"$f":"IFERROR(IF(M19=\"No\",INDEX(IndexMatch!C:C,MATCH(1,(IndexMatch!A:A=VLOOKUP(H19,'Drop Down'!K:L,2,0))*(IndexMatch!B:B=L19),0)),\"Service Already Opened\"),\"N/A\")","v":"Service Already Opened"},0,{"$f":"IF(O19>VLOOKUP(L19,'Drop Down'!$A$3:$B$10,2,0),\"1\",\"0\")","v":"0"},0,{"$f":"SUM(Table1[[#This Row],[Case Aide Hours]],Table1[[#This Row],[Case Aide Travel Time]])","v":0},{"$f":"IFERROR(IF(OR(Table1[[#This Row],[Child Support Level]]=\"Support Services Lvl 1\", Table1[[#This Row],[Child Support Level]]=\"Support Services Lvl 2\",Table1[[#This Row],[Child Support Level]]=\"Select\"),\"Case Aid Not Allowed\", PRODUCT(Table1[[#This Row],[Total Case Aide]],VLOOKUP(Table1[[#This Row],[County Where Youth Resides]],'Drop Down'!K:M,3,0))),\"0\")","v":"Case Aid Not Allowed"},"No",0,0]
["Select","-","-","-","-","DD/MM/YYYY","DD/MM/YYYY","Select","Select",{"$f":"VLOOKUP(Table1[[#This Row],[DCYF Case Region]],'Drop Down'!$F$3:$G$9,2,0)","v":"Select"},"Select","Select","Select",{"$f":"IFERROR(IF(M20=\"No\",INDEX(IndexMatch!C:C,MATCH(1,(IndexMatch!A:A=VLOOKUP(H20,'Drop Down'!K:L,2,0))*(IndexMatch!B:B=L20),0)),\"Service Already Opened\"),\"N/A\")","v":"Service Already Opened"},0,{"$f":"IF(O20>VLOOKUP(L20,'Drop Down'!$A$3:$B$10,2,0),\"1\",\"0\")","v":"0"},0,{"$f":"SUM(Table1[[#This Row],[Case Aide Hours]],Table1[[#This Row],[Case Aide Travel Time]])","v":0},{"$f":"IFERROR(IF(OR(Table1[[#This Row],[Child Support Level]]=\"Support Services Lvl 1\", Table1[[#This Row],[Child Support Level]]=\"Support Services Lvl 2\",Table1[[#This Row],[Child Support Level]]=\"Select\"),\"Case Aid Not Allowed\", PRODUCT(Table1[[#This Row],[Total Case Aide]],VLOOKUP(Table1[[#This Row],[County Where Youth Resides]],'Drop Down'!K:M,3,0))),\"0\")","v":"Case Aid Not Allowed"},"No",0,0]
["Select","-","-","-","-","DD/MM/YYYY","DD/MM/YYYY","Select","Select",{"$f":"VLOOKUP(Table1[[#This Row],[DCYF Case Region]],'Drop Down'!$F$3:$G$9,2,0)","v":"Select"},"Select","Select","Select",{"$f":"IFERROR(IF(M21=\"No\",INDEX(IndexMatch!C:C,MATCH(1,(IndexMatch!A:A=VLOOKUP(H21,'Drop Down'!K:L,2,0))*(IndexMatch!B:B=L21),0)),\"Service Already Opened\"),\"N/A\")","v":"Service Already Opened"},0,{"$f":"IF(O21>VLOOKUP(L21,'Drop Down'!$A$3:$B$10,2,0),\"1\",\"0\")","v":"0"},0,{"$f":"SUM(Table1[[#This Row],[Case Aide Hours]],Table1[[#This Row],[Case Aide Travel Time]])","v":0},{"$f":"IFERROR(IF(OR(Table1[[#This Row],[Child Support Level]]=\"Support Services Lvl 1\", Table1[[#This Row],[Child Support Level]]=\"Support Services Lvl 2\",Table1[[#This Row],[Child Support Level]]=\"Select\"),\"Case Aid Not Allowed\", PRODUCT(Table1[[#This Row],[Total Case Aide]],VLOOKUP(Table1[[#This Row],[County Where Youth Resides]],'Drop Down'!K:M,3,0))),\"0\")","v":"Case Aid Not Allowed"},"No",0,0]
["Select","-","-","-","-","DD/MM/YYYY","DD/MM/YYYY","Select","Select",{"$f":"VLOOKUP(Table1[[#This Row],[DCYF Case Region]],'Drop Down'!$F$3:$G$9,2,0)","v":"Select"},"Select","Select","Select",{"$f":"IFERROR(IF(M22=\"No\",INDEX(IndexMatch!C:C,MATCH(1,(IndexMatch!A:A=VLOOKUP(H22,'Drop Down'!K:L,2,0))*(IndexMatch!B:B=L22),0)),\"Service Already Opened\"),\"N/A\")","v":"Service Already Opened"},0,{"$f":"IF(O22>VLOOKUP(L22,'Drop Down'!$A$3:$B$10,2,0),\"1\",\"0\")","v":"0"},0,{"$f":"SUM(Table1[[#This Row],[Case Aide Hours]],Table1[[#This Row],[Case Aide Travel Time]])","v":0},{"$f":"IFERROR(IF(OR(Table1[[#This Row],[Child Support Level]]=\"Support Services Lvl 1\", Table1[[#This Row],[Child Support Level]]=\"Support Services Lvl 2\",Table1[[#This Row],[Child Support Level]]=\"Select\"),\"Case Aid Not Allowed\", PRODUCT(Table1[[#This Row],[Total Case Aide]],VLOOKUP(Table1[[#This Row],[County Where Youth Resides]],'Drop Down'!K:M,3,0))),\"0\")","v":"Case Aid Not Allowed"},"No",0,0]
["Select","-","-","-","-","DD/MM/YYYY","DD/MM/YYYY","Select","Select",{"$f":"VLOOKUP(Table1[[#This Row],[DCYF Case Region]],'Drop Down'!$F$3:$G$9,2,0)","v":"Select"},"Select","Select","Select",{"$f":"IFERROR(IF(M23=\"No\",INDEX(IndexMatch!C:C,MATCH(1,(IndexMatch!A:A=VLOOKUP(H23,'Drop Down'!K:L,2,0))*(IndexMatch!B:B=L23),0)),\"Service Already Opened\"),\"N/A\")","v":"Service Already Opened"},0,{"$f":"IF(O23>VLOOKUP(L23,'Drop Down'!$A$3:$B$10,2,0),\"1\",\"0\")","v":"0"},0,{"$f":"SUM(Table1[[#This Row],[Case Aide Hours]],Table1[[#This Row],[Case Aide Travel Time]])","v":0},{"$f":"IFERROR(IF(OR(Table1[[#This Row],[Child Support Level]]=\"Support Services Lvl 1\", Table1[[#This Row],[Child Support Level]]=\"Support Services Lvl 2\",Table1[[#This Row],[Child Support Level]]=\"Select\"),\"Case Aid Not Allowed\", PRODUCT(Table1[[#This Row],[Total Case Aide]],VLOOKUP(Table1[[#This Row],[County Where Youth Resides]],'Drop Down'!K:M,3,0))),\"0\")","v":"Case Aid Not Allowed"},"No",0,0]
["Select","-","-","-","-","DD/MM/YYYY","DD/MM/YYYY","Select","Select",{"$f":"VLOOKUP(Table1[[#This Row],[DCYF Case Region]],'Drop Down'!$F$3:$G$9,2,0)","v":"Select"},"Select","Select","Select",{"$f":"IFERROR(IF(M24=\"No\",INDEX(IndexMatch!C:C,MATCH(1,(IndexMatch!A:A=VLOOKUP(H24,'Drop Down'!K:L,2,0))*(IndexMatch!B:B=L24),0)),\"Service Already Opened\"),\"N/A\")","v":"Service Already Opened"},0,{"$f":"IF(O24>VLOOKUP(L24,'Drop Down'!$A$3:$B$10,2,0),\"1\",\"0\")","v":"0"},0,{"$f":"SUM(Table1[[#This Row],[Case Aide Hours]],Table1[[#This Row],[Case Aide Travel Time]])","v":0},{"$f":"IFERROR(IF(OR(Table1[[#This Row],[Child Support Level]]=\"Support Services Lvl 1\", Table1[[#This Row],[Child Support Level]]=\"Support Services Lvl 2\",Table1[[#This Row],[Child Support Level]]=\"Select\"),\"Case Aid Not Allowed\", PRODUCT(Table1[[#This Row],[Total Case Aide]],VLOOKUP(Table1[[#This Row],[County Where Youth Resides]],'Drop Down'!K:M,3,0))),\"0\")","v":"Case Aid Not Allowed"},"No",0,0]
["Select","-","-","-","-","DD/MM/YYYY","DD/MM/YYYY","Select","Select",{"$f":"VLOOKUP(Table1[[#This Row],[DCYF Case Region]],'Drop Down'!$F$3:$G$9,2,0)","v":"Select"},"Select","Select","Select",{"$f":"IFERROR(IF(M25=\"No\",INDEX(IndexMatch!C:C,MATCH(1,(IndexMatch!A:A=VLOOKUP(H25,'Drop Down'!K:L,2,0))*(IndexMatch!B:B=L25),0)),\"Service Already Opened\"),\"N/A\")","v":"Service Already Opened"},0,{"$f":"IF(O25>VLOOKUP(L25,'Drop Down'!$A$3:$B$10,2,0),\"1\",\"0\")","v":"0"},0,{"$f":"SUM(Table1[[#This Row],[Case Aide Hours]],Table1[[#This Row],[Case Aide Travel Time]])","v":0},{"$f":"IFERROR(IF(OR(Table1[[#This Row],[Child Support Level]]=\"Support Services Lvl 1\", Table1[[#This Row],[Child Support Level]]=\"Support Services Lvl 2\",Table1[[#This Row],[Child Support Level]]=\"Select\"),\"Case Aid Not Allowed\", PRODUCT(Table1[[#This Row],[Total Case Aide]],VLOOKUP(Table1[[#This Row],[County Where Youth Resides]],'Drop Down'!K:M,3,0))),\"0\")","v":"Case Aid Not Allowed"},"No",0,0]
["Select","-","-","-","-","DD/MM/YYYY","DD/MM/YYYY","Select","Select",{"$f":"VLOOKUP(Table1[[#This Row],[DCYF Case Region]],'Drop Down'!$F$3:$G$9,2,0)","v":"Select"},"Select","Select","Select",{"$f":"IFERROR(IF(M26=\"No\",INDEX(IndexMatch!C:C,MATCH(1,(IndexMatch!A:A=VLOOKUP(H26,'Drop Down'!K:L,2,0))*(IndexMatch!B:B=L26),0)),\"Service Already Opened\"),\"N/A\")","v":"Service Already Opened"},0,{"$f":"IF(O26>VLOOKUP(L26,'Drop Down'!$A$3:$B$10,2,0),\"1\",\"0\")","v":"0"},0,{"$f":"SUM(Table1[[#This Row],[Case Aide Hours]],Table1[[#This Row],[Case Aide Travel Time]])","v":0},{"$f":"IFERROR(IF(OR(Table1[[#This Row],[Child Support Level]]=\"Support Services Lvl 1\", Table1[[#This Row],[Child Support Level]]=\"Support Services Lvl 2\",Table1[[#This Row],[Child Support Level]]=\"Select\"),\"Case Aid Not Allowed\", PRODUCT(Table1[[#This Row],[Total Case Aide]],VLOOKUP(Table1[[#This Row],[County Where Youth Resides]],'Drop Down'!K:M,3,0))),\"0\")","v":"Case Aid Not Allowed"},"No",0,0]
["Select","-","-","-","-","DD/MM/YYYY","DD/MM/YYYY","Select","Select",{"$f":"VLOOKUP(Table1[[#This Row],[DCYF Case Region]],'Drop Down'!$F$3:$G$9,2,0)","v":"Select"},"Select","Select","Select",{"$f":"IFERROR(IF(M27=\"No\",INDEX(IndexMatch!C:C,MATCH(1,(IndexMatch!A:A=VLOOKUP(H27,'Drop Down'!K:L,2,0))*(IndexMatch!B:B=L27),0)),\"Service Already Opened\"),\"N/A\")","v":"Service Already Opened"},0,{"$f":"IF(O27>VLOOKUP(L27,'Drop Down'!$A$3:$B$10,2,0),\"1\",\"0\")","v":"0"},0,{"$f":"SUM(Table1[[#This Row],[Case Aide Hours]],Table1[[#This Row],[Case Aide Travel Time]])","v":0},{"$f":"IFERROR(IF(OR(Table1[[#This Row],[Child Support Level]]=\"Support Services Lvl 1\", Table1[[#This Row],[Child Support Level]]=\"Support Services Lvl 2\",Table1[[#This Row],[Child Support Level]]=\"Select\"),\"Case Aid Not Allowed\", PRODUCT(Table1[[#This Row],[Total Case Aide]],VLOOKUP(Table1[[#This Row],[County Where Youth Resides]],'Drop Down'!K:M,3,0))),\"0\")","v":"Case Aid Not Allowed"},"No",0,0]
["Select","-","-","-","-","DD/MM/YYYY","DD/MM/YYYY","Select","Select",{"$f":"VLOOKUP(Table1[[#This Row],[DCYF Case Region]],'Drop Down'!$F$3:$G$9,2,0)","v":"Select"},"Select","Select","Select",{"$f":"IFERROR(IF(M28=\"No\",INDEX(IndexMatch!C:C,MATCH(1,(IndexMatch!A:A=VLOOKUP(H28,'Drop Down'!K:L,2,0))*(IndexMatch!B:B=L28),0)),\"Service Already Opened\"),\"N/A\")","v":"Service Already Opened"},0,{"$f":"IF(O28>VLOOKUP(L28,'Drop Down'!$A$3:$B$10,2,0),\"1\",\"0\")","v":"0"},0,{"$f":"SUM(Table1[[#This Row],[Case Aide Hours]],Table1[[#This Row],[Case Aide Travel Time]])","v":0},{"$f":"IFERROR(IF(OR(Table1[[#This Row],[Child Support Level]]=\"Support Services Lvl 1\", Table1[[#This Row],[Child Support Level]]=\"Support Services Lvl 2\",Table1[[#This Row],[Child Support Level]]=\"Select\"),\"Case Aid Not Allowed\", PRODUCT(Table1[[#This Row],[Total Case Aide]],VLOOKUP(Table1[[#This Row],[County Where Youth Resides]],'Drop Down'!K:M,3,0))),\"0\")","v":"Case Aid Not Allowed"},"No",0,0]
["Select","-","-","-","-","DD/MM/YYYY","DD/MM/YYYY","Select","Select",{"$f":"VLOOKUP(Table1[[#This Row],[DCYF Case Region]],'Drop Down'!$F$3:$G$9,2,0)","v":"Select"},"Select","Select","Select",{"$f":"IFERROR(IF(M29=\"No\",INDEX(IndexMatch!C:C,MATCH(1,(IndexMatch!A:A=VLOOKUP(H29,'Drop Down'!K:L,2,0))*(IndexMatch!B:B=L29),0)),\"Service Already Opened\"),\"N/A\")","v":"Service Already Opened"},0,{"$f":"IF(O29>VLOOKUP(L29,'Drop Down'!$A$3:$B$10,2,0),\"1\",\"0\")","v":"0"},0,{"$f":"SUM(Table1[[#This Row],[Case Aide Hours]],Table1[[#This Row],[Case Aide Travel Time]])","v":0},{"$f":"IFERROR(IF(OR(Table1[[#This Row],[Child Support Level]]=\"Support Services Lvl 1\", Table1[[#This Row],[Child Support Level]]=\"Support Services Lvl 2\",Table1[[#This Row],[Child Support Level]]=\"Select\"),\"Case Aid Not Allowed\", PRODUCT(Table1[[#This Row],[Total Case Aide]],VLOOKUP(Table1[[#This Row],[County Where Youth Resides]],'Drop Down'!K:M,3,0))),\"0\")","v":"Case Aid Not Allowed"},"No",0,0]
["Select","-","-","-","-","DD/MM/YYYY","DD/MM/YYYY","Select","Select",{"$f":"VLOOKUP(Table1[[#This Row],[DCYF Case Region]],'Drop Down'!$F$3:$G$9,2,0)","v":"Select"},"Select","Select","Select",{"$f":"IFERROR(IF(M30=\"No\",INDEX(IndexMatch!C:C,MATCH(1,(IndexMatch!A:A=VLOOKUP(H30,'Drop Down'!K:L,2,0))*(IndexMatch!B:B=L30),0)),\"Service Already Opened\"),\"N/A\")","v":"Service Already Opened"},0,{"$f":"IF(O30>VLOOKUP(L30,'Drop Down'!$A$3:$B$10,2,0),\"1\",\"0\")","v":"0"},0,{"$f":"SUM(Table1[[#This Row],[Case Aide Hours]],Table1[[#This Row],[Case Aide Travel Time]])","v":0},{"$f":"IFERROR(IF(OR(Table1[[#This Row],[Child Support Level]]=\"Support Services Lvl 1\", Table1[[#This Row],[Child Support Level]]=\"Support Services Lvl 2\",Table1[[#This Row],[Child Support Level]]=\"Select\"),\"Case Aid Not Allowed\", PRODUCT(Table1[[#This Row],[Total Case Aide]],VLOOKUP(Table1[[#This Row],[County Where Youth Resides]],'Drop Down'!K:M,3,0))),\"0\")","v":"Case Aid Not Allowed"},"No",0,0]
["Select","-","-","-","-","DD/MM/YYYY","DD/MM/YYYY","Select","Select",{"$f":"VLOOKUP(Table1[[#This Row],[DCYF Case Region]],'Drop Down'!$F$3:$G$9,2,0)","v":"Select"},"Select","Select","Select",{"$f":"IFERROR(IF(M31=\"No\",INDEX(IndexMatch!C:C,MATCH(1,(IndexMatch!A:A=VLOOKUP(H31,'Drop Down'!K:L,2,0))*(IndexMatch!B:B=L31),0)),\"Service Already Opened\"),\"N/A\")","v":"Service Already Opened"},0,{"$f":"IF(O31>VLOOKUP(L31,'Drop Down'!$A$3:$B$10,2,0),\"1\",\"0\")","v":"0"},0,{"$f":"SUM(Table1[[#This Row],[Case Aide Hours]],Table1[[#This Row],[Case Aide Travel Time]])","v":0},{"$f":"IFERROR(IF(OR(Table1[[#This Row],[Child Support Level]]=\"Support Services Lvl 1\", Table1[[#This Row],[Child Support Level]]=\"Support Services Lvl 2\",Table1[[#This Row],[Child Support Level]]=\"Select\"),\"Case Aid Not Allowed\", PRODUCT(Table1[[#This Row],[Total Case Aide]],VLOOKUP(Table1[[#This Row],[County Where Youth Resides]],'Drop Down'!K:M,3,0))),\"0\")","v":"Case Aid Not Allowed"},"No",0,0]
["Select","-","-","-","-","DD/MM/YYYY","DD/MM/YYYY","Select","Select",{"$f":"VLOOKUP(Table1[[#This Row],[DCYF Case Region]],'Drop Down'!$F$3:$G$9,2,0)","v":"Select"},"Select","Select","Select",{"$f":"IFERROR(IF(M32=\"No\",INDEX(IndexMatch!C:C,MATCH(1,(IndexMatch!A:A=VLOOKUP(H32,'Drop Down'!K:L,2,0))*(IndexMatch!B:B=L32),0)),\"Service Already Opened\"),\"N/A\")","v":"Service Already Opened"},0,{"$f":"IF(O32>VLOOKUP(L32,'Drop Down'!$A$3:$B$10,2,0),\"1\",\"0\")","v":"0"},0,{"$f":"SUM(Table1[[#This Row],[Case Aide Hours]],Table1[[#This Row],[Case Aide Travel Time]])","v":0},{"$f":"IFERROR(IF(OR(Table1[[#This Row],[Child Support Level]]=\"Support Services Lvl 1\", Table1[[#This Row],[Child Support Level]]=\"Support Services Lvl 2\",Table1[[#This Row],[Child Support Level]]=\"Select\"),\"Case Aid Not Allowed\", PRODUCT(Table1[[#This Row],[Total Case Aide]],VLOOKUP(Table1[[#This Row],[County Where Youth Resides]],'Drop Down'!K:M,3,0))),\"0\")","v":"Case Aid Not Allowed"},"No",0,0]
["Select","-","-","-","-","DD/MM/YYYY","DD/MM/YYYY","Select","Select",{"$f":"VLOOKUP(Table1[[#This Row],[DCYF Case Region]],'Drop Down'!$F$3:$G$9,2,0)","v":"Select"},"Select","Select","Select",{"$f":"IFERROR(IF(M33=\"No\",INDEX(IndexMatch!C:C,MATCH(1,(IndexMatch!A:A=VLOOKUP(H33,'Drop Down'!K:L,2,0))*(IndexMatch!B:B=L33),0)),\"Service Already Opened\"),\"N/A\")","v":"Service Already Opened"},0,{"$f":"IF(O33>VLOOKUP(L33,'Drop Down'!$A$3:$B$10,2,0),\"1\",\"0\")","v":"0"},0,{"$f":"SUM(Table1[[#This Row],[Case Aide Hours]],Table1[[#This Row],[Case Aide Travel Time]])","v":0},{"$f":"IFERROR(IF(OR(Table1[[#This Row],[Child Support Level]]=\"Support Services Lvl 1\", Table1[[#This Row],[Child Support Level]]=\"Support Services Lvl 2\",Table1[[#This Row],[Child Support Level]]=\"Select\"),\"Case Aid Not Allowed\", PRODUCT(Table1[[#This Row],[Total Case Aide]],VLOOKUP(Table1[[#This Row],[County Where Youth Resides]],'Drop Down'!K:M,3,0))),\"0\")","v":"Case Aid Not Allowed"},"No",0,0]
["Select","-","-","-","-","DD/MM/YYYY","DD/MM/YYYY","Select","Select",{"$f":"VLOOKUP(Table1[[#This Row],[DCYF Case Region]],'Drop Down'!$F$3:$G$9,2,0)","v":"Select"},"Select","Select","Select",{"$f":"IFERROR(IF(M34=\"No\",INDEX(IndexMatch!C:C,MATCH(1,(IndexMatch!A:A=VLOOKUP(H34,'Drop Down'!K:L,2,0))*(IndexMatch!B:B=L34),0)),\"Service Already Opened\"),\"N/A\")","v":"Service Already Opened"},0,{"$f":"IF(O34>VLOOKUP(L34,'Drop Down'!$A$3:$B$10,2,0),\"1\",\"0\")","v":"0"},0,{"$f":"SUM(Table1[[#This Row],[Case Aide Hours]],Table1[[#This Row],[Case Aide Travel Time]])","v":0},{"$f":"IFERROR(IF(OR(Table1[[#This Row],[Child Support Level]]=\"Support Services Lvl 1\", Table1[[#This Row],[Child Support Level]]=\"Support Services Lvl 2\",Table1[[#This Row],[Child Support Level]]=\"Select\"),\"Case Aid Not Allowed\", PRODUCT(Table1[[#This Row],[Total Case Aide]],VLOOKUP(Table1[[#This Row],[County Where Youth Resides]],'Drop Down'!K:M,3,0))),\"0\")","v":"Case Aid Not Allowed"},"No",0,0]
["Select","-","-","-","-","DD/MM/YYYY","DD/MM/YYYY","Select","Select",{"$f":"VLOOKUP(Table1[[#This Row],[DCYF Case Region]],'Drop Down'!$F$3:$G$9,2,0)","v":"Select"},"Select","Select","Select",{"$f":"IFERROR(IF(M35=\"No\",INDEX(IndexMatch!C:C,MATCH(1,(IndexMatch!A:A=VLOOKUP(H35,'Drop Down'!K:L,2,0))*(IndexMatch!B:B=L35),0)),\"Service Already Opened\"),\"N/A\")","v":"Service Already Opened"},0,{"$f":"IF(O35>VLOOKUP(L35,'Drop Down'!$A$3:$B$10,2,0),\"1\",\"0\")","v":"0"},0,{"$f":"SUM(Table1[[#This Row],[Case Aide Hours]],Table1[[#This Row],[Case Aide Travel Time]])","v":0},{"$f":"IFERROR(IF(OR(Table1[[#This Row],[Child Support Level]]=\"Support Services Lvl 1\", Table1[[#This Row],[Child Support Level]]=\"Support Services Lvl 2\",Table1[[#This Row],[Child Support Level]]=\"Select\"),\"Case Aid Not Allowed\", PRODUCT(Table1[[#This Row],[Total Case Aide]],VLOOKUP(Table1[[#This Row],[County Where Youth Resides]],'Drop Down'!K:M,3,0))),\"0\")","v":"Case Aid Not Allowed"},"No",0,0]
["Select","-","-","-","-","DD/MM/YYYY","DD/MM/YYYY","Select","Select",{"$f":"VLOOKUP(Table1[[#This Row],[DCYF Case Region]],'Drop Down'!$F$3:$G$9,2,0)","v":"Select"},"Select","Select","Select",{"$f":"IFERROR(IF(M36=\"No\",INDEX(IndexMatch!C:C,MATCH(1,(IndexMatch!A:A=VLOOKUP(H36,'Drop Down'!K:L,2,0))*(IndexMatch!B:B=L36),0)),\"Service Already Opened\"),\"N/A\")","v":"Service Already Opened"},0,{"$f":"IF(O36>VLOOKUP(L36,'Drop Down'!$A$3:$B$10,2,0),\"1\",\"0\")","v":"0"},0,{"$f":"SUM(Table1[[#This Row],[Case Aide Hours]],Table1[[#This Row],[Case Aide Travel Time]])","v":0},{"$f":"IFERROR(IF(OR(Table1[[#This Row],[Child Support Level]]=\"Support Services Lvl 1\", Table1[[#This Row],[Child Support Level]]=\"Support Services Lvl 2\",Table1[[#This Row],[Child Support Level]]=\"Select\"),\"Case Aid Not Allowed\", PRODUCT(Table1[[#This Row],[Total Case Aide]],VLOOKUP(Table1[[#This Row],[County Where Youth Resides]],'Drop Down'!K:M,3,0))),\"0\")","v":"Case Aid Not Allowed"},"No",0,0]
["Select","-","-","-","-","DD/MM/YYYY","DD/MM/YYYY","Select","Select",{"$f":"VLOOKUP(Table1[[#This Row],[DCYF Case Region]],'Drop Down'!$F$3:$G$9,2,0)","v":"Select"},"Select","Select","Select",{"$f":"IFERROR(IF(M37=\"No\",INDEX(IndexMatch!C:C,MATCH(1,(IndexMatch!A:A=VLOOKUP(H37,'Drop Down'!K:L,2,0))*(IndexMatch!B:B=L37),0)),\"Service Already Opened\"),\"N/A\")","v":"Service Already Opened"},0,{"$f":"IF(O37>VLOOKUP(L37,'Drop Down'!$A$3:$B$10,2,0),\"1\",\"0\")","v":"0"},0,{"$f":"SUM(Table1[[#This Row],[Case Aide Hours]],Table1[[#This Row],[Case Aide Travel Time]])","v":0},{"$f":"IFERROR(IF(OR(Table1[[#This Row],[Child Support Level]]=\"Support Services Lvl 1\", Table1[[#This Row],[Child Support Level]]=\"Support Services Lvl 2\",Table1[[#This Row],[Child Support Level]]=\"Select\"),\"Case Aid Not Allowed\", PRODUCT(Table1[[#This Row],[Total Case Aide]],VLOOKUP(Table1[[#This Row],[County Where Youth Resides]],'Drop Down'!K:M,3,0))),\"0\")","v":"Case Aid Not Allowed"},"No",0,0]
["Select","-","-","-","-","DD/MM/YYYY","DD/MM/YYYY","Select","Select",{"$f":"VLOOKUP(Table1[[#This Row],[DCYF Case Region]],'Drop Down'!$F$3:$G$9,2,0)","v":"Select"},"Select","Select","Select",{"$f":"IFERROR(IF(M38=\"No\",INDEX(IndexMatch!C:C,MATCH(1,(IndexMatch!A:A=VLOOKUP(H38,'Drop Down'!K:L,2,0))*(IndexMatch!B:B=L38),0)),\"Service Already Opened\"),\"N/A\")","v":"Service Already Opened"},0,{"$f":"IF(O38>VLOOKUP(L38,'Drop Down'!$A$3:$B$10,2,0),\"1\",\"0\")","v":"0"},0,{"$f":"SUM(Table1[[#This Row],[Case Aide Hours]],Table1[[#This Row],[Case Aide Travel Time]])","v":0},{"$f":"IFERROR(IF(OR(Table1[[#This Row],[Child Support Level]]=\"Support Services Lvl 1\", Table1[[#This Row],[Child Support Level]]=\"Support Services Lvl 2\",Table1[[#This Row],[Child Support Level]]=\"Select\"),\"Case Aid Not Allowed\", PRODUCT(Table1[[#This Row],[Total Case Aide]],VLOOKUP(Table1[[#This Row],[County Where Youth Resides]],'Drop Down'!K:M,3,0))),\"0\")","v":"Case Aid Not Allowed"},"No",0,0]
["Select","-","-","-","-","DD/MM/YYYY","DD/MM/YYYY","Select","Select",{"$f":"VLOOKUP(Table1[[#This Row],[DCYF Case Region]],'Drop Down'!$F$3:$G$9,2,0)","v":"Select"},"Select","Select","Select",{"$f":"IFERROR(IF(M39=\"No\",INDEX(IndexMatch!C:C,MATCH(1,(IndexMatch!A:A=VLOOKUP(H39,'Drop Down'!K:L,2,0))*(IndexMatch!B:B=L39),0)),\"Service Already Opened\"),\"N/A\")","v":"Service Already Opened"},0,{"$f":"IF(O39>VLOOKUP(L39,'Drop Down'!$A$3:$B$10,2,0),\"1\",\"0\")","v":"0"},0,{"$f":"SUM(Table1[[#This Row],[Case Aide Hours]],Table1[[#This Row],[Case Aide Travel Time]])","v":0},{"$f":"IFERROR(IF(OR(Table1[[#This Row],[Child Support Level]]=\"Support Services Lvl 1\", Table1[[#This Row],[Child Support Level]]=\"Support Services Lvl 2\",Table1[[#This Row],[Child Support Level]]=\"Select\"),\"Case Aid Not Allowed\", PRODUCT(Table1[[#This Row],[Total Case Aide]],VLOOKUP(Table1[[#This Row],[County Where Youth Resides]],'Drop Down'!K:M,3,0))),\"0\")","v":"Case Aid Not Allowed"},"No",0,0]
["Select","-","-","-","-","DD/MM/YYYY","DD/MM/YYYY","Select","Select",{"$f":"VLOOKUP(Table1[[#This Row],[DCYF Case Region]],'Drop Down'!$F$3:$G$9,2,0)","v":"Select"},"Select","Select","Select",{"$f":"IFERROR(IF(M40=\"No\",INDEX(IndexMatch!C:C,MATCH(1,(IndexMatch!A:A=VLOOKUP(H40,'Drop Down'!K:L,2,0))*(IndexMatch!B:B=L40),0)),\"Service Already Opened\"),\"N/A\")","v":"Service Already Opened"},0,{"$f":"IF(O40>VLOOKUP(L40,'Drop Down'!$A$3:$B$10,2,0),\"1\",\"0\")","v":"0"},0,{"$f":"SUM(Table1[[#This Row],[Case Aide Hours]],Table1[[#This Row],[Case Aide Travel Time]])","v":0},{"$f":"IFERROR(IF(OR(Table1[[#This Row],[Child Support Level]]=\"Support Services Lvl 1\", Table1[[#This Row],[Child Support Level]]=\"Support Services Lvl 2\",Table1[[#This Row],[Child Support Level]]=\"Select\"),\"Case Aid Not Allowed\", PRODUCT(Table1[[#This Row],[Total Case Aide]],VLOOKUP(Table1[[#This Row],[County Where Youth Resides]],'Drop Down'!K:M,3,0))),\"0\")","v":"Case Aid Not Allowed"},"No",0,0]
["Select","-","-","-","-","DD/MM/YYYY","DD/MM/YYYY","Select","Select",{"$f":"VLOOKUP(Table1[[#This Row],[DCYF Case Region]],'Drop Down'!$F$3:$G$9,2,0)","v":"Select"},"Select","Select","Select",{"$f":"IFERROR(IF(M41=\"No\",INDEX(IndexMatch!C:C,MATCH(1,(IndexMatch!A:A=VLOOKUP(H41,'Drop Down'!K:L,2,0))*(IndexMatch!B:B=L41),0)),\"Service Already Opened\"),\"N/A\")","v":"Service Already Opened"},0,{"$f":"IF(O41>VLOOKUP(L41,'Drop Down'!$A$3:$B$10,2,0),\"1\",\"0\")","v":"0"},0,{"$f":"SUM(Table1[[#This Row],[Case Aide Hours]],Table1[[#This Row],[Case Aide Travel Time]])","v":0},{"$f":"IFERROR(IF(OR(Table1[[#This Row],[Child Support Level]]=\"Support Services Lvl 1\", Table1[[#This Row],[Child Support Level]]=\"Support Services Lvl 2\",Table1[[#This Row],[Child Support Level]]=\"Select\"),\"Case Aid Not Allowed\", PRODUCT(Table1[[#This Row],[Total Case Aide]],VLOOKUP(Table1[[#This Row],[County Where Youth Resides]],'Drop Down'!K:M,3,0))),\"0\")","v":"Case Aid Not Allowed"},"No",0,0]
["Select","-","-","-","-","DD/MM/YYYY","DD/MM/YYYY","Select","Select",{"$f":"VLOOKUP(Table1[[#This Row],[DCYF Case Region]],'Drop Down'!$F$3:$G$9,2,0)","v":"Select"},"Select","Select","Select",{"$f":"IFERROR(IF(M42=\"No\",INDEX(IndexMatch!C:C,MATCH(1,(IndexMatch!A:A=VLOOKUP(H42,'Drop Down'!K:L,2,0))*(IndexMatch!B:B=L42),0)),\"Service Already Opened\"),\"N/A\")","v":"Service Already Opened"},0,{"$f":"IF(O42>VLOOKUP(L42,'Drop Down'!$A$3:$B$10,2,0),\"1\",\"0\")","v":"0"},0,{"$f":"SUM(Table1[[#This Row],[Case Aide Hours]],Table1[[#This Row],[Case Aide Travel Time]])","v":0},{"$f":"IFERROR(IF(OR(Table1[[#This Row],[Child Support Level]]=\"Support Services Lvl 1\", Table1[[#This Row],[Child Support Level]]=\"Support Services Lvl 2\",Table1[[#This Row],[Child Support Level]]=\"Select\"),\"Case Aid Not Allowed\", PRODUCT(Table1[[#This Row],[Total Case Aide]],VLOOKUP(Table1[[#This Row],[County Where Youth Resides]],'Drop Down'!K:M,3,0))),\"0\")","v":"Case Aid Not Allowed"},"No",0,0]
["Select","-","-","-","-","DD/MM/YYYY","DD/MM/YYYY","Select","Select",{"$f":"VLOOKUP(Table1[[#This Row],[DCYF Case Region]],'Drop Down'!$F$3:$G$9,2,0)","v":"Select"},"Select","Select","Select",{"$f":"IFERROR(IF(M43=\"No\",INDEX(IndexMatch!C:C,MATCH(1,(IndexMatch!A:A=VLOOKUP(H43,'Drop Down'!K:L,2,0))*(IndexMatch!B:B=L43),0)),\"Service Already Opened\"),\"N/A\")","v":"Service Already Opened"},0,{"$f":"IF(O43>VLOOKUP(L43,'Drop Down'!$A$3:$B$10,2,0),\"1\",\"0\")","v":"0"},0,{"$f":"SUM(Table1[[#This Row],[Case Aide Hours]],Table1[[#This Row],[Case Aide Travel Time]])","v":0},{"$f":"IFERROR(IF(OR(Table1[[#This Row],[Child Support Level]]=\"Support Services Lvl 1\", Table1[[#This Row],[Child Support Level]]=\"Support Services Lvl 2\",Table1[[#This Row],[Child Support Level]]=\"Select\"),\"Case Aid Not Allowed\", PRODUCT(Table1[[#This Row],[Total Case Aide]],VLOOKUP(Table1[[#This Row],[County Where Youth Resides]],'Drop Down'!K:M,3,0))),\"0\")","v":"Case Aid Not Allowed"},"No",0,0]
["Select","-","-","-","-","DD/MM/YYYY","DD/MM/YYYY","Select","Select",{"$f":"VLOOKUP(Table1[[#This Row],[DCYF Case Region]],'Drop Down'!$F$3:$G$9,2,0)","v":"Select"},"Select","Select","Select",{"$f":"IFERROR(IF(M44=\"No\",INDEX(IndexMatch!C:C,MATCH(1,(IndexMatch!A:A=VLOOKUP(H44,'Drop Down'!K:L,2,0))*(IndexMatch!B:B=L44),0)),\"Service Already Opened\"),\"N/A\")","v":"Service Already Opened"},0,{"$f":"IF(O44>VLOOKUP(L44,'Drop Down'!$A$3:$B$10,2,0),\"1\",\"0\")","v":"0"},0,{"$f":"SUM(Table1[[#This Row],[Case Aide Hours]],Table1[[#This Row],[Case Aide Travel Time]])","v":0},{"$f":"IFERROR(IF(OR(Table1[[#This Row],[Child Support Level]]=\"Support Services Lvl 1\", Table1[[#This Row],[Child Support Level]]=\"Support Services Lvl 2\",Table1[[#This Row],[Child Support Level]]=\"Select\"),\"Case Aid Not Allowed\", PRODUCT(Table1[[#This Row],[Total Case Aide]],VLOOKUP(Table1[[#This Row],[County Where Youth Resides]],'Drop Down'!K:M,3,0))),\"0\")","v":"Case Aid Not Allowed"},"No",0,0]
["Select","-","-","-","-","DD/MM/YYYY","DD/MM/YYYY","Select","Select",{"$f":"VLOOKUP(Table1[[#This Row],[DCYF Case Region]],'Drop Down'!$F$3:$G$9,2,0)","v":"Select"},"Select","Select","Select",{"$f":"IFERROR(IF(M45=\"No\",INDEX(IndexMatch!C:C,MATCH(1,(IndexMatch!A:A=VLOOKUP(H45,'Drop Down'!K:L,2,0))*(IndexMatch!B:B=L45),0)),\"Service Already Opened\"),\"N/A\")","v":"Service Already Opened"},0,{"$f":"IF(O45>VLOOKUP(L45,'Drop Down'!$A$3:$B$10,2,0),\"1\",\"0\")","v":"0"},0,{"$f":"SUM(Table1[[#This Row],[Case Aide Hours]],Table1[[#This Row],[Case Aide Travel Time]])","v":0},{"$f":"IFERROR(IF(OR(Table1[[#This Row],[Child Support Level]]=\"Support Services Lvl 1\", Table1[[#This Row],[Child Support Level]]=\"Support Services Lvl 2\",Table1[[#This Row],[Child Support Level]]=\"Select\"),\"Case Aid Not Allowed\", PRODUCT(Table1[[#This Row],[Total Case Aide]],VLOOKUP(Table1[[#This Row],[County Where Youth Resides]],'Drop Down'!K:M,3,0))),\"0\")","v":"Case Aid Not Allowed"},"No",0,0]
["Select","-","-","-","-","DD/MM/YYYY","DD/MM/YYYY","Select","Select",{"$f":"VLOOKUP(Table1[[#This Row],[DCYF Case Region]],'Drop Down'!$F$3:$G$9,2,0)","v":"Select"},"Select","Select","Select",{"$f":"IFERROR(IF(M46=\"No\",INDEX(IndexMatch!C:C,MATCH(1,(IndexMatch!A:A=VLOOKUP(H46,'Drop Down'!K:L,2,0))*(IndexMatch!B:B=L46),0)),\"Service Already Opened\"),\"N/A\")","v":"Service Already Opened"},0,{"$f":"IF(O46>VLOOKUP(L46,'Drop Down'!$A$3:$B$10,2,0),\"1\",\"0\")","v":"0"},0,{"$f":"SUM(Table1[[#This Row],[Case Aide Hours]],Table1[[#This Row],[Case Aide Travel Time]])","v":0},{"$f":"IFERROR(IF(OR(Table1[[#This Row],[Child Support Level]]=\"Support Services Lvl 1\", Table1[[#This Row],[Child Support Level]]=\"Support Services Lvl 2\",Table1[[#This Row],[Child Support Level]]=\"Select\"),\"Case Aid Not Allowed\", PRODUCT(Table1[[#This Row],[Total Case Aide]],VLOOKUP(Table1[[#This Row],[County Where Youth Resides]],'Drop Down'!K:M,3,0))),\"0\")","v":"Case Aid Not Allowed"},"No",0,0]
["Select","-","-","-","-","DD/MM/YYYY","DD/MM/YYYY","Select","Select",{"$f":"VLOOKUP(Table1[[#This Row],[DCYF Case Region]],'Drop Down'!$F$3:$G$9,2,0)","v":"Select"},"Select","Select","Select",{"$f":"IFERROR(IF(M47=\"No\",INDEX(IndexMatch!C:C,MATCH(1,(IndexMatch!A:A=VLOOKUP(H47,'Drop Down'!K:L,2,0))*(IndexMatch!B:B=L47),0)),\"Service Already Opened\"),\"N/A\")","v":"Service Already Opened"},0,{"$f":"IF(O47>VLOOKUP(L47,'Drop Down'!$A$3:$B$10,2,0),\"1\",\"0\")","v":"0"},0,{"$f":"SUM(Table1[[#This Row],[Case Aide Hours]],Table1[[#This Row],[Case Aide Travel Time]])","v":0},{"$f":"IFERROR(IF(OR(Table1[[#This Row],[Child Support Level]]=\"Support Services Lvl 1\", Table1[[#This Row],[Child Support Level]]=\"Support Services Lvl 2\",Table1[[#This Row],[Child Support Level]]=\"Select\"),\"Case Aid Not Allowed\", PRODUCT(Table1[[#This Row],[Total Case Aide]],VLOOKUP(Table1[[#This Row],[County Where Youth Resides]],'Drop Down'!K:M,3,0))),\"0\")","v":"Case Aid Not Allowed"},"No",0,0]
["Select","-","-","-","-","DD/MM/YYYY","DD/MM/YYYY","Select","Select",{"$f":"VLOOKUP(Table1[[#This Row],[DCYF Case Region]],'Drop Down'!$F$3:$G$9,2,0)","v":"Select"},"Select","Select","Select",{"$f":"IFERROR(IF(M48=\"No\",INDEX(IndexMatch!C:C,MATCH(1,(IndexMatch!A:A=VLOOKUP(H48,'Drop Down'!K:L,2,0))*(IndexMatch!B:B=L48),0)),\"Service Already Opened\"),\"N/A\")","v":"Service Already Opened"},0,{"$f":"IF(O48>VLOOKUP(L48,'Drop Down'!$A$3:$B$10,2,0),\"1\",\"0\")","v":"0"},0,{"$f":"SUM(Table1[[#This Row],[Case Aide Hours]],Table1[[#This Row],[Case Aide Travel Time]])","v":0},{"$f":"IFERROR(IF(OR(Table1[[#This Row],[Child Support Level]]=\"Support Services Lvl 1\", Table1[[#This Row],[Child Support Level]]=\"Support Services Lvl 2\",Table1[[#This Row],[Child Support Level]]=\"Select\"),\"Case Aid Not Allowed\", PRODUCT(Table1[[#This Row],[Total Case Aide]],VLOOKUP(Table1[[#This Row],[County Where Youth Resides]],'Drop Down'!K:M,3,0))),\"0\")","v":"Case Aid Not Allowed"},"No",0,0]
["Select","-","-","-","-","DD/MM/YYYY","DD/MM/YYYY","Select","Select",{"$f":"VLOOKUP(Table1[[#This Row],[DCYF Case Region]],'Drop Down'!$F$3:$G$9,2,0)","v":"Select"},"Select","Select","Select",{"$f":"IFERROR(IF(M49=\"No\",INDEX(IndexMatch!C:C,MATCH(1,(IndexMatch!A:A=VLOOKUP(H49,'Drop Down'!K:L,2,0))*(IndexMatch!B:B=L49),0)),\"Service Already Opened\"),\"N/A\")","v":"Service Already Opened"},0,{"$f":"IF(O49>VLOOKUP(L49,'Drop Down'!$A$3:$B$10,2,0),\"1\",\"0\")","v":"0"},0,{"$f":"SUM(Table1[[#This Row],[Case Aide Hours]],Table1[[#This Row],[Case Aide Travel Time]])","v":0},{"$f":"IFERROR(IF(OR(Table1[[#This Row],[Child Support Level]]=\"Support Services Lvl 1\", Table1[[#This Row],[Child Support Level]]=\"Support Services Lvl 2\",Table1[[#This Row],[Child Support Level]]=\"Select\"),\"Case Aid Not Allowed\", PRODUCT(Table1[[#This Row],[Total Case Aide]],VLOOKUP(Table1[[#This Row],[County Where Youth Resides]],'Drop Down'!K:M,3,0))),\"0\")","v":"Case Aid Not Allowed"},"No",0,0]
["Select","-","-","-","-","DD/MM/YYYY","DD/MM/YYYY","Select","Select",{"$f":"VLOOKUP(Table1[[#This Row],[DCYF Case Region]],'Drop Down'!$F$3:$G$9,2,0)","v":"Select"},"Select","Select","Select",{"$f":"IFERROR(IF(M50=\"No\",INDEX(IndexMatch!C:C,MATCH(1,(IndexMatch!A:A=VLOOKUP(H50,'Drop Down'!K:L,2,0))*(IndexMatch!B:B=L50),0)),\"Service Already Opened\"),\"N/A\")","v":"Service Already Opened"},0,{"$f":"IF(O50>VLOOKUP(L50,'Drop Down'!$A$3:$B$10,2,0),\"1\",\"0\")","v":"0"},0,{"$f":"SUM(Table1[[#This Row],[Case Aide Hours]],Table1[[#This Row],[Case Aide Travel Time]])","v":0},{"$f":"IFERROR(IF(OR(Table1[[#This Row],[Child Support Level]]=\"Support Services Lvl 1\", Table1[[#This Row],[Child Support Level]]=\"Support Services Lvl 2\",Table1[[#This Row],[Child Support Level]]=\"Select\"),\"Case Aid Not Allowed\", PRODUCT(Table1[[#This Row],[Total Case Aide]],VLOOKUP(Table1[[#This Row],[County Where Youth Resides]],'Drop Down'!K:M,3,0))),\"0\")","v":"Case Aid Not Allowed"},"No",0,0]
["Select","-","-","-","-","DD/MM/YYYY","DD/MM/YYYY","Select","Select",{"$f":"VLOOKUP(Table1[[#This Row],[DCYF Case Region]],'Drop Down'!$F$3:$G$9,2,0)","v":"Select"},"Select","Select","Select",{"$f":"IFERROR(IF(M51=\"No\",INDEX(IndexMatch!C:C,MATCH(1,(IndexMatch!A:A=VLOOKUP(H51,'Drop Down'!K:L,2,0))*(IndexMatch!B:B=L51),0)),\"Service Already Opened\"),\"N/A\")","v":"Service Already Opened"},0,{"$f":"IF(O51>VLOOKUP(L51,'Drop Down'!$A$3:$B$10,2,0),\"1\",\"0\")","v":"0"},0,{"$f":"SUM(Table1[[#This Row],[Case Aide Hours]],Table1[[#This Row],[Case Aide Travel Time]])","v":0},{"$f":"IFERROR(IF(OR(Table1[[#This Row],[Child Support Level]]=\"Support Services Lvl 1\", Table1[[#This Row],[Child Support Level]]=\"Support Services Lvl 2\",Table1[[#This Row],[Child Support Level]]=\"Select\"),\"Case Aid Not Allowed\", PRODUCT(Table1[[#This Row],[Total Case Aide]],VLOOKUP(Table1[[#This Row],[County Where Youth Resides]],'Drop Down'!K:M,3,0))),\"0\")","v":"Case Aid Not Allowed"},"No",0,0]
["Select","-","-","-","-","DD/MM/YYYY","DD/MM/YYYY","Select","Select",{"$f":"VLOOKUP(Table1[[#This Row],[DCYF Case Region]],'Drop Down'!$F$3:$G$9,2,0)","v":"Select"},"Select","Select","Select",{"$f":"IFERROR(IF(M52=\"No\",INDEX(IndexMatch!C:C,MATCH(1,(IndexMatch!A:A=VLOOKUP(H52,'Drop Down'!K:L,2,0))*(IndexMatch!B:B=L52),0)),\"Service Already Opened\"),\"N/A\")","v":"Service Already Opened"},0,{"$f":"IF(O52>VLOOKUP(L52,'Drop Down'!$A$3:$B$10,2,0),\"1\",\"0\")","v":"0"},0,{"$f":"SUM(Table1[[#This Row],[Case Aide Hours]],Table1[[#This Row],[Case Aide Travel Time]])","v":0},{"$f":"IFERROR(IF(OR(Table1[[#This Row],[Child Support Level]]=\"Support Services Lvl 1\", Table1[[#This Row],[Child Support Level]]=\"Support Services Lvl 2\",Table1[[#This Row],[Child Support Level]]=\"Select\"),\"Case Aid Not Allowed\", PRODUCT(Table1[[#This Row],[Total Case Aide]],VLOOKUP(Table1[[#This Row],[County Where Youth Resides]],'Drop Down'!K:M,3,0))),\"0\")","v":"Case Aid Not Allowed"},"No",0,0]
["Select","-","-","-","-","DD/MM/YYYY","DD/MM/YYYY","Select","Select",{"$f":"VLOOKUP(Table1[[#This Row],[DCYF Case Region]],'Drop Down'!$F$3:$G$9,2,0)","v":"Select"},"Select","Select","Select",{"$f":"IFERROR(IF(M53=\"No\",INDEX(IndexMatch!C:C,MATCH(1,(IndexMatch!A:A=VLOOKUP(H53,'Drop Down'!K:L,2,0))*(IndexMatch!B:B=L53),0)),\"Service Already Opened\"),\"N/A\")","v":"Service Already Opened"},0,{"$f":"IF(O53>VLOOKUP(L53,'Drop Down'!$A$3:$B$10,2,0),\"1\",\"0\")","v":"0"},0,{"$f":"SUM(Table1[[#This Row],[Case Aide Hours]],Table1[[#This Row],[Case Aide Travel Time]])","v":0},{"$f":"IFERROR(IF(OR(Table1[[#This Row],[Child Support Level]]=\"Support Services Lvl 1\", Table1[[#This Row],[Child Support Level]]=\"Support Services Lvl 2\",Table1[[#This Row],[Child Support Level]]=\"Select\"),\"Case Aid Not Allowed\", PRODUCT(Table1[[#This Row],[Total Case Aide]],VLOOKUP(Table1[[#This Row],[County Where Youth Resides]],'Drop Down'!K:M,3,0))),\"0\")","v":"Case Aid Not Allowed"},"No",0,0]
["Select","-","-","-","-","DD/MM/YYYY","DD/MM/YYYY","Select","Select",{"$f":"VLOOKUP(Table1[[#This Row],[DCYF Case Region]],'Drop Down'!$F$3:$G$9,2,0)","v":"Select"},"Select","Select","Select",{"$f":"IFERROR(IF(M54=\"No\",INDEX(IndexMatch!C:C,MATCH(1,(IndexMatch!A:A=VLOOKUP(H54,'Drop Down'!K:L,2,0))*(IndexMatch!B:B=L54),0)),\"Service Already Opened\"),\"N/A\")","v":"Service Already Opened"},0,{"$f":"IF(O54>VLOOKUP(L54,'Drop Down'!$A$3:$B$10,2,0),\"1\",\"0\")","v":"0"},0,{"$f":"SUM(Table1[[#This Row],[Case Aide Hours]],Table1[[#This Row],[Case Aide Travel Time]])","v":0},{"$f":"IFERROR(IF(OR(Table1[[#This Row],[Child Support Level]]=\"Support Services Lvl 1\", Table1[[#This Row],[Child Support Level]]=\"Support Services Lvl 2\",Table1[[#This Row],[Child Support Level]]=\"Select\"),\"Case Aid Not Allowed\", PRODUCT(Table1[[#This Row],[Total Case Aide]],VLOOKUP(Table1[[#This Row],[County Where Youth Resides]],'Drop Down'!K:M,3,0))),\"0\")","v":"Case Aid Not Allowed"},"No",0,0]
["Select","-","-","-","-","DD/MM/YYYY","DD/MM/YYYY","Select","Select",{"$f":"VLOOKUP(Table1[[#This Row],[DCYF Case Region]],'Drop Down'!$F$3:$G$9,2,0)","v":"Select"},"Select","Select","Select",{"$f":"IFERROR(IF(M55=\"No\",INDEX(IndexMatch!C:C,MATCH(1,(IndexMatch!A:A=VLOOKUP(H55,'Drop Down'!K:L,2,0))*(IndexMatch!B:B=L55),0)),\"Service Already Opened\"),\"N/A\")","v":"Service Already Opened"},0,{"$f":"IF(O55>VLOOKUP(L55,'Drop Down'!$A$3:$B$10,2,0),\"1\",\"0\")","v":"0"},0,{"$f":"SUM(Table1[[#This Row],[Case Aide Hours]],Table1[[#This Row],[Case Aide Travel Time]])","v":0},{"$f":"IFERROR(IF(OR(Table1[[#This Row],[Child Support Level]]=\"Support Services Lvl 1\", Table1[[#This Row],[Child Support Level]]=\"Support Services Lvl 2\",Table1[[#This Row],[Child Support Level]]=\"Select\"),\"Case Aid Not Allowed\", PRODUCT(Table1[[#This Row],[Total Case Aide]],VLOOKUP(Table1[[#This Row],[County Where Youth Resides]],'Drop Down'!K:M,3,0))),\"0\")","v":"Case Aid Not Allowed"},"No",0,0]
["Select","-","-","-","-","DD/MM/YYYY","DD/MM/YYYY","Select","Select",{"$f":"VLOOKUP(Table1[[#This Row],[DCYF Case Region]],'Drop Down'!$F$3:$G$9,2,0)","v":"Select"},"Select","Select","Select",{"$f":"IFERROR(IF(M56=\"No\",INDEX(IndexMatch!C:C,MATCH(1,(IndexMatch!A:A=VLOOKUP(H56,'Drop Down'!K:L,2,0))*(IndexMatch!B:B=L56),0)),\"Service Already Opened\"),\"N/A\")","v":"Service Already Opened"},0,{"$f":"IF(O56>VLOOKUP(L56,'Drop Down'!$A$3:$B$10,2,0),\"1\",\"0\")","v":"0"},0,{"$f":"SUM(Table1[[#This Row],[Case Aide Hours]],Table1[[#This Row],[Case Aide Travel Time]])","v":0},{"$f":"IFERROR(IF(OR(Table1[[#This Row],[Child Support Level]]=\"Support Services Lvl 1\", Table1[[#This Row],[Child Support Level]]=\"Support Services Lvl 2\",Table1[[#This Row],[Child Support Level]]=\"Select\"),\"Case Aid Not Allowed\", PRODUCT(Table1[[#This Row],[Total Case Aide]],VLOOKUP(Table1[[#This Row],[County Where Youth Resides]],'Drop Down'!K:M,3,0))),\"0\")","v":"Case Aid Not Allowed"},"No",0,0]
["Select","-","-","-","-","DD/MM/YYYY","DD/MM/YYYY","Select","Select",{"$f":"VLOOKUP(Table1[[#This Row],[DCYF Case Region]],'Drop Down'!$F$3:$G$9,2,0)","v":"Select"},"Select","Select","Select",{"$f":"IFERROR(IF(M57=\"No\",INDEX(IndexMatch!C:C,MATCH(1,(IndexMatch!A:A=VLOOKUP(H57,'Drop Down'!K:L,2,0))*(IndexMatch!B:B=L57),0)),\"Service Already Opened\"),\"N/A\")","v":"Service Already Opened"},0,{"$f":"IF(O57>VLOOKUP(L57,'Drop Down'!$A$3:$B$10,2,0),\"1\",\"0\")","v":"0"},0,{"$f":"SUM(Table1[[#This Row],[Case Aide Hours]],Table1[[#This Row],[Case Aide Travel Time]])","v":0},{"$f":"IFERROR(IF(OR(Table1[[#This Row],[Child Support Level]]=\"Support Services Lvl 1\", Table1[[#This Row],[Child Support Level]]=\"Support Services Lvl 2\",Table1[[#This Row],[Child Support Level]]=\"Select\"),\"Case Aid Not Allowed\", PRODUCT(Table1[[#This Row],[Total Case Aide]],VLOOKUP(Table1[[#This Row],[County Where Youth Resides]],'Drop Down'!K:M,3,0))),\"0\")","v":"Case Aid Not Allowed"},"No",0,0]
["Select","-","-","-","-","DD/MM/YYYY","DD/MM/YYYY","Select","Select",{"$f":"VLOOKUP(Table1[[#This Row],[DCYF Case Region]],'Drop Down'!$F$3:$G$9,2,0)","v":"Select"},"Select","Select","Select",{"$f":"IFERROR(IF(M58=\"No\",INDEX(IndexMatch!C:C,MATCH(1,(IndexMatch!A:A=VLOOKUP(H58,'Drop Down'!K:L,2,0))*(IndexMatch!B:B=L58),0)),\"Service Already Opened\"),\"N/A\")","v":"Service Already Opened"},0,{"$f":"IF(O58>VLOOKUP(L58,'Drop Down'!$A$3:$B$10,2,0),\"1\",\"0\")","v":"0"},0,{"$f":"SUM(Table1[[#This Row],[Case Aide Hours]],Table1[[#This Row],[Case Aide Travel Time]])","v":0},{"$f":"IFERROR(IF(OR(Table1[[#This Row],[Child Support Level]]=\"Support Services Lvl 1\", Table1[[#This Row],[Child Support Level]]=\"Support Services Lvl 2\",Table1[[#This Row],[Child Support Level]]=\"Select\"),\"Case Aid Not Allowed\", PRODUCT(Table1[[#This Row],[Total Case Aide]],VLOOKUP(Table1[[#This Row],[County Where Youth Resides]],'Drop Down'!K:M,3,0))),\"0\")","v":"Case Aid Not Allowed"},"No",0,0]
["Select","-","-","-","-","DD/MM/YYYY","DD/MM/YYYY","Select","Select",{"$f":"VLOOKUP(Table1[[#This Row],[DCYF Case Region]],'Drop Down'!$F$3:$G$9,2,0)","v":"Select"},"Select","Select","Select",{"$f":"IFERROR(IF(M59=\"No\",INDEX(IndexMatch!C:C,MATCH(1,(IndexMatch!A:A=VLOOKUP(H59,'Drop Down'!K:L,2,0))*(IndexMatch!B:B=L59),0)),\"Service Already Opened\"),\"N/A\")","v":"Service Already Opened"},0,{"$f":"IF(O59>VLOOKUP(L59,'Drop Down'!$A$3:$B$10,2,0),\"1\",\"0\")","v":"0"},0,{"$f":"SUM(Table1[[#This Row],[Case Aide Hours]],Table1[[#This Row],[Case Aide Travel Time]])","v":0},{"$f":"IFERROR(IF(OR(Table1[[#This Row],[Child Support Level]]=\"Support Services Lvl 1\", Table1[[#This Row],[Child Support Level]]=\"Support Services Lvl 2\",Table1[[#This Row],[Child Support Level]]=\"Select\"),\"Case Aid Not Allowed\", PRODUCT(Table1[[#This Row],[Total Case Aide]],VLOOKUP(Table1[[#This Row],[County Where Youth Resides]],'Drop Down'!K:M,3,0))),\"0\")","v":"Case Aid Not Allowed"},"No",0,0]
["Select","-","-","-","-","DD/MM/YYYY","DD/MM/YYYY","Select","Select",{"$f":"VLOOKUP(Table1[[#This Row],[DCYF Case Region]],'Drop Down'!$F$3:$G$9,2,0)","v":"Select"},"Select","Select","Select",{"$f":"IFERROR(IF(M60=\"No\",INDEX(IndexMatch!C:C,MATCH(1,(IndexMatch!A:A=VLOOKUP(H60,'Drop Down'!K:L,2,0))*(IndexMatch!B:B=L60),0)),\"Service Already Opened\"),\"N/A\")","v":"Service Already Opened"},0,{"$f":"IF(O60>VLOOKUP(L60,'Drop Down'!$A$3:$B$10,2,0),\"1\",\"0\")","v":"0"},0,{"$f":"SUM(Table1[[#This Row],[Case Aide Hours]],Table1[[#This Row],[Case Aide Travel Time]])","v":0},{"$f":"IFERROR(IF(OR(Table1[[#This Row],[Child Support Level]]=\"Support Services Lvl 1\", Table1[[#This Row],[Child Support Level]]=\"Support Services Lvl 2\",Table1[[#This Row],[Child Support Level]]=\"Select\"),\"Case Aid Not Allowed\", PRODUCT(Table1[[#This Row],[Total Case Aide]],VLOOKUP(Table1[[#This Row],[County Where Youth Resides]],'Drop Down'!K:M,3,0))),\"0\")","v":"Case Aid Not Allowed"},"No",0,0]
["Select","-","-","-","-","DD/MM/YYYY","DD/MM/YYYY","Select","Select",{"$f":"VLOOKUP(Table1[[#This Row],[DCYF Case Region]],'Drop Down'!$F$3:$G$9,2,0)","v":"Select"},"Select","Select","Select",{"$f":"IFERROR(IF(M61=\"No\",INDEX(IndexMatch!C:C,MATCH(1,(IndexMatch!A:A=VLOOKUP(H61,'Drop Down'!K:L,2,0))*(IndexMatch!B:B=L61),0)),\"Service Already Opened\"),\"N/A\")","v":"Service Already Opened"},0,{"$f":"IF(O61>VLOOKUP(L61,'Drop Down'!$A$3:$B$10,2,0),\"1\",\"0\")","v":"0"},0,{"$f":"SUM(Table1[[#This Row],[Case Aide Hours]],Table1[[#This Row],[Case Aide Travel Time]])","v":0},{"$f":"IFERROR(IF(OR(Table1[[#This Row],[Child Support Level]]=\"Support Services Lvl 1\", Table1[[#This Row],[Child Support Level]]=\"Support Services Lvl 2\",Table1[[#This Row],[Child Support Level]]=\"Select\"),\"Case Aid Not Allowed\", PRODUCT(Table1[[#This Row],[Total Case Aide]],VLOOKUP(Table1[[#This Row],[County Where Youth Resides]],'Drop Down'!K:M,3,0))),\"0\")","v":"Case Aid Not Allowed"},"No",0,0]
["Select","-","-","-","-","DD/MM/YYYY","DD/MM/YYYY","Select","Select",{"$f":"VLOOKUP(Table1[[#This Row],[DCYF Case Region]],'Drop Down'!$F$3:$G$9,2,0)","v":"Select"},"Select","Select","Select",{"$f":"IFERROR(IF(M62=\"No\",INDEX(IndexMatch!C:C,MATCH(1,(IndexMatch!A:A=VLOOKUP(H62,'Drop Down'!K:L,2,0))*(IndexMatch!B:B=L62),0)),\"Service Already Opened\"),\"N/A\")","v":"Service Already Opened"},0,{"$f":"IF(O62>VLOOKUP(L62,'Drop Down'!$A$3:$B$10,2,0),\"1\",\"0\")","v":"0"},0,{"$f":"SUM(Table1[[#This Row],[Case Aide Hours]],Table1[[#This Row],[Case Aide Travel Time]])","v":0},{"$f":"IFERROR(IF(OR(Table1[[#This Row],[Child Support Level]]=\"Support Services Lvl 1\", Table1[[#This Row],[Child Support Level]]=\"Support Services Lvl 2\",Table1[[#This Row],[Child Support Level]]=\"Select\"),\"Case Aid Not Allowed\", PRODUCT(Table1[[#This Row],[Total Case Aide]],VLOOKUP(Table1[[#This Row],[County Where Youth Resides]],'Drop Down'!K:M,3,0))),\"0\")","v":"Case Aid Not Allowed"},"No",0,0]
["Select","-","-","-","-","DD/MM/YYYY","DD/MM/YYYY","Select","Select",{"$f":"VLOOKUP(Table1[[#This Row],[DCYF Case Region]],'Drop Down'!$F$3:$G$9,2,0)","v":"Select"},"Select","Select","Select",{"$f":"IFERROR(IF(M63=\"No\",INDEX(IndexMatch!C:C,MATCH(1,(IndexMatch!A:A=VLOOKUP(H63,'Drop Down'!K:L,2,0))*(IndexMatch!B:B=L63),0)),\"Service Already Opened\"),\"N/A\")","v":"Service Already Opened"},0,{"$f":"IF(O63>VLOOKUP(L63,'Drop Down'!$A$3:$B$10,2,0),\"1\",\"0\")","v":"0"},0,{"$f":"SUM(Table1[[#This Row],[Case Aide Hours]],Table1[[#This Row],[Case Aide Travel Time]])","v":0},{"$f":"IFERROR(IF(OR(Table1[[#This Row],[Child Support Level]]=\"Support Services Lvl 1\", Table1[[#This Row],[Child Support Level]]=\"Support Services Lvl 2\",Table1[[#This Row],[Child Support Level]]=\"Select\"),\"Case Aid Not Allowed\", PRODUCT(Table1[[#This Row],[Total Case Aide]],VLOOKUP(Table1[[#This Row],[County Where Youth Resides]],'Drop Down'!K:M,3,0))),\"0\")","v":"Case Aid Not Allowed"},"No",0,0]
["Select","-","-","-","-","DD/MM/YYYY","DD/MM/YYYY","Select","Select",{"$f":"VLOOKUP(Table1[[#This Row],[DCYF Case Region]],'Drop Down'!$F$3:$G$9,2,0)","v":"Select"},"Select","Select","Select",{"$f":"IFERROR(IF(M64=\"No\",INDEX(IndexMatch!C:C,MATCH(1,(IndexMatch!A:A=VLOOKUP(H64,'Drop Down'!K:L,2,0))*(IndexMatch!B:B=L64),0)),\"Service Already Opened\"),\"N/A\")","v":"Service Already Opened"},0,{"$f":"IF(O64>VLOOKUP(L64,'Drop Down'!$A$3:$B$10,2,0),\"1\",\"0\")","v":"0"},0,{"$f":"SUM(Table1[[#This Row],[Case Aide Hours]],Table1[[#This Row],[Case Aide Travel Time]])","v":0},{"$f":"IFERROR(IF(OR(Table1[[#This Row],[Child Support Level]]=\"Support Services Lvl 1\", Table1[[#This Row],[Child Support Level]]=\"Support Services Lvl 2\",Table1[[#This Row],[Child Support Level]]=\"Select\"),\"Case Aid Not Allowed\", PRODUCT(Table1[[#This Row],[Total Case Aide]],VLOOKUP(Table1[[#This Row],[County Where Youth Resides]],'Drop Down'!K:M,3,0))),\"0\")","v":"Case Aid Not Allowed"},"No",0,0]
["Select","-","-","-","-","DD/MM/YYYY","DD/MM/YYYY","Select","Select",{"$f":"VLOOKUP(Table1[[#This Row],[DCYF Case Region]],'Drop Down'!$F$3:$G$9,2,0)","v":"Select"},"Select","Select","Select",{"$f":"IFERROR(IF(M65=\"No\",INDEX(IndexMatch!C:C,MATCH(1,(IndexMatch!A:A=VLOOKUP(H65,'Drop Down'!K:L,2,0))*(IndexMatch!B:B=L65),0)),\"Service Already Opened\"),\"N/A\")","v":"Service Already Opened"},0,{"$f":"IF(O65>VLOOKUP(L65,'Drop Down'!$A$3:$B$10,2,0),\"1\",\"0\")","v":"0"},0,{"$f":"SUM(Table1[[#This Row],[Case Aide Hours]],Table1[[#This Row],[Case Aide Travel Time]])","v":0},{"$f":"IFERROR(IF(OR(Table1[[#This Row],[Child Support Level]]=\"Support Services Lvl 1\", Table1[[#This Row],[Child Support Level]]=\"Support Services Lvl 2\",Table1[[#This Row],[Child Support Level]]=\"Select\"),\"Case Aid Not Allowed\", PRODUCT(Table1[[#This Row],[Total Case Aide]],VLOOKUP(Table1[[#This Row],[County Where Youth Resides]],'Drop Down'!K:M,3,0))),\"0\")","v":"Case Aid Not Allowed"},"No",0,0]
["Select","-","-","-","-","DD/MM/YYYY","DD/MM/YYYY","Select","Select",{"$f":"VLOOKUP(Table1[[#This Row],[DCYF Case Region]],'Drop Down'!$F$3:$G$9,2,0)","v":"Select"},"Select","Select","Select",{"$f":"IFERROR(IF(M66=\"No\",INDEX(IndexMatch!C:C,MATCH(1,(IndexMatch!A:A=VLOOKUP(H66,'Drop Down'!K:L,2,0))*(IndexMatch!B:B=L66),0)),\"Service Already Opened\"),\"N/A\")","v":"Service Already Opened"},0,{"$f":"IF(O66>VLOOKUP(L66,'Drop Down'!$A$3:$B$10,2,0),\"1\",\"0\")","v":"0"},0,{"$f":"SUM(Table1[[#This Row],[Case Aide Hours]],Table1[[#This Row],[Case Aide Travel Time]])","v":0},{"$f":"IFERROR(IF(OR(Table1[[#This Row],[Child Support Level]]=\"Support Services Lvl 1\", Table1[[#This Row],[Child Support Level]]=\"Support Services Lvl 2\",Table1[[#This Row],[Child Support Level]]=\"Select\"),\"Case Aid Not Allowed\", PRODUCT(Table1[[#This Row],[Total Case Aide]],VLOOKUP(Table1[[#This Row],[County Where Youth Resides]],'Drop Down'!K:M,3,0))),\"0\")","v":"Case Aid Not Allowed"},"No",0,{"$f":"ROUND(PRODUCT(U66,0.67),2)","v":0}]
["Select","-","-","-","-","DD/MM/YYYY","DD/MM/YYYY","Select","Select",{"$f":"VLOOKUP(Table1[[#This Row],[DCYF Case Region]],'Drop Down'!$F$3:$G$9,2,0)","v":"Select"},"Select","Select","Select",{"$f":"IFERROR(IF(M67=\"No\",INDEX(IndexMatch!C:C,MATCH(1,(IndexMatch!A:A=VLOOKUP(H67,'Drop Down'!K:L,2,0))*(IndexMatch!B:B=L67),0)),\"Service Already Opened\"),\"N/A\")","v":"Service Already Opened"},0,{"$f":"IF(O67>VLOOKUP(L67,'Drop Down'!$A$3:$B$10,2,0),\"1\",\"0\")","v":"0"},0,{"$f":"SUM(Table1[[#This Row],[Case Aide Hours]],Table1[[#This Row],[Case Aide Travel Time]])","v":0},{"$f":"IFERROR(IF(OR(Table1[[#This Row],[Child Support Level]]=\"Support Services Lvl 1\", Table1[[#This Row],[Child Support Level]]=\"Support Services Lvl 2\",Table1[[#This Row],[Child Support Level]]=\"Select\"),\"Case Aid Not Allowed\", PRODUCT(Table1[[#This Row],[Total Case Aide]],VLOOKUP(Table1[[#This Row],[County Where Youth Resides]],'Drop Down'!K:M,3,0))),\"0\")","v":"Case Aid Not Allowed"},{"$f":"IF(P67=\"1\",\"Yes\",\"No\")","v":"No"},0,0]
["Select","-","-","-","-","DD/MM/YYYY","DD/MM/YYYY","Select","Select",{"$f":"VLOOKUP(Table1[[#This Row],[DCYF Case Region]],'Drop Down'!$F$3:$G$9,2,0)","v":"Select"},"Select","Select","Select",{"$f":"IFERROR(IF(M68=\"No\",INDEX(IndexMatch!C:C,MATCH(1,(IndexMatch!A:A=VLOOKUP(H68,'Drop Down'!K:L,2,0))*(IndexMatch!B:B=L68),0)),\"Service Already Opened\"),\"N/A\")","v":"Service Already Opened"},0,{"$f":"IF(O68>VLOOKUP(L68,'Drop Down'!$A$3:$B$10,2,0),\"1\",\"0\")","v":"0"},0,{"$f":"SUM(Table1[[#This Row],[Case Aide Hours]],Table1[[#This Row],[Case Aide Travel Time]])","v":0},{"$f":"IFERROR(IF(OR(Table1[[#This Row],[Child Support Level]]=\"Support Services Lvl 1\", Table1[[#This Row],[Child Support Level]]=\"Support Services Lvl 2\",Table1[[#This Row],[Child Support Level]]=\"Select\"),\"Case Aid Not Allowed\", PRODUCT(Table1[[#This Row],[Total Case Aide]],VLOOKUP(Table1[[#This Row],[County Where Youth Resides]],'Drop Down'!K:M,3,0))),\"0\")","v":"Case Aid Not Allowed"},"No",0,0]
["Select","-","-","-","-","DD/MM/YYYY","DD/MM/YYYY","Select","Select",{"$f":"VLOOKUP(Table1[[#This Row],[DCYF Case Region]],'Drop Down'!$F$3:$G$9,2,0)","v":"Select"},"Select","Select","Select",{"$f":"IFERROR(IF(M69=\"No\",INDEX(IndexMatch!C:C,MATCH(1,(IndexMatch!A:A=VLOOKUP(H69,'Drop Down'!K:L,2,0))*(IndexMatch!B:B=L69),0)),\"Service Already Opened\"),\"N/A\")","v":"Service Already Opened"},0,{"$f":"IF(O69>VLOOKUP(L69,'Drop Down'!$A$3:$B$10,2,0),\"1\",\"0\")","v":"0"},0,{"$f":"SUM(Table1[[#This Row],[Case Aide Hours]],Table1[[#This Row],[Case Aide Travel Time]])","v":0},{"$f":"IFERROR(IF(OR(Table1[[#This Row],[Child Support Level]]=\"Support Services Lvl 1\", Table1[[#This Row],[Child Support Level]]=\"Support Services Lvl 2\",Table1[[#This Row],[Child Support Level]]=\"Select\"),\"Case Aid Not Allowed\", PRODUCT(Table1[[#This Row],[Total Case Aide]],VLOOKUP(Table1[[#This Row],[County Where Youth Resides]],'Drop Down'!K:M,3,0))),\"0\")","v":"Case Aid Not Allowed"},"No",0,0]
["Select","-","-","-","-","DD/MM/YYYY","DD/MM/YYYY","Select","Select",{"$f":"VLOOKUP(Table1[[#This Row],[DCYF Case Region]],'Drop Down'!$F$3:$G$9,2,0)","v":"Select"},"Select","Select","Select",{"$f":"IFERROR(IF(M70=\"No\",INDEX(IndexMatch!C:C,MATCH(1,(IndexMatch!A:A=VLOOKUP(H70,'Drop Down'!K:L,2,0))*(IndexMatch!B:B=L70),0)),\"Service Already Opened\"),\"N/A\")","v":"Service Already Opened"},0,{"$f":"IF(O70>VLOOKUP(L70,'Drop Down'!$A$3:$B$10,2,0),\"1\",\"0\")","v":"0"},0,{"$f":"SUM(Table1[[#This Row],[Case Aide Hours]],Table1[[#This Row],[Case Aide Travel Time]])","v":0},{"$f":"IFERROR(IF(OR(Table1[[#This Row],[Child Support Level]]=\"Support Services Lvl 1\", Table1[[#This Row],[Child Support Level]]=\"Support Services Lvl 2\",Table1[[#This Row],[Child Support Level]]=\"Select\"),\"Case Aid Not Allowed\", PRODUCT(Table1[[#This Row],[Total Case Aide]],VLOOKUP(Table1[[#This Row],[County Where Youth Resides]],'Drop Down'!K:M,3,0))),\"0\")","v":"Case Aid Not Allowed"},"No",0,0]
["Select","-","-","-","-","DD/MM/YYYY","DD/MM/YYYY","Select","Select",{"$f":"VLOOKUP(Table1[[#This Row],[DCYF Case Region]],'Drop Down'!$F$3:$G$9,2,0)","v":"Select"},"Select","Select","Select",{"$f":"IFERROR(IF(M71=\"No\",INDEX(IndexMatch!C:C,MATCH(1,(IndexMatch!A:A=VLOOKUP(H71,'Drop Down'!K:L,2,0))*(IndexMatch!B:B=L71),0)),\"Service Already Opened\"),\"N/A\")","v":"Service Already Opened"},0,{"$f":"IF(O71>VLOOKUP(L71,'Drop Down'!$A$3:$B$10,2,0),\"1\",\"0\")","v":"0"},0,{"$f":"SUM(Table1[[#This Row],[Case Aide Hours]],Table1[[#This Row],[Case Aide Travel Time]])","v":0},{"$f":"IFERROR(IF(OR(Table1[[#This Row],[Child Support Level]]=\"Support Services Lvl 1\", Table1[[#This Row],[Child Support Level]]=\"Support Services Lvl 2\",Table1[[#This Row],[Child Support Level]]=\"Select\"),\"Case Aid Not Allowed\", PRODUCT(Table1[[#This Row],[Total Case Aide]],VLOOKUP(Table1[[#This Row],[County Where Youth Resides]],'Drop Down'!K:M,3,0))),\"0\")","v":"Case Aid Not Allowed"},"No",0,0]
["Select","-","-","-","-","DD/MM/YYYY","DD/MM/YYYY","Select","Select",{"$f":"VLOOKUP(Table1[[#This Row],[DCYF Case Region]],'Drop Down'!$F$3:$G$9,2,0)","v":"Select"},"Select","Select","Select",{"$f":"IFERROR(IF(M72=\"No\",INDEX(IndexMatch!C:C,MATCH(1,(IndexMatch!A:A=VLOOKUP(H72,'Drop Down'!K:L,2,0))*(IndexMatch!B:B=L72),0)),\"Service Already Opened\"),\"N/A\")","v":"Service Already Opened"},0,{"$f":"IF(O72>VLOOKUP(L72,'Drop Down'!$A$3:$B$10,2,0),\"1\",\"0\")","v":"0"},0,{"$f":"SUM(Table1[[#This Row],[Case Aide Hours]],Table1[[#This Row],[Case Aide Travel Time]])","v":0},{"$f":"IFERROR(IF(OR(Table1[[#This Row],[Child Support Level]]=\"Support Services Lvl 1\", Table1[[#This Row],[Child Support Level]]=\"Support Services Lvl 2\",Table1[[#This Row],[Child Support Level]]=\"Select\"),\"Case Aid Not Allowed\", PRODUCT(Table1[[#This Row],[Total Case Aide]],VLOOKUP(Table1[[#This Row],[County Where Youth Resides]],'Drop Down'!K:M,3,0))),\"0\")","v":"Case Aid Not Allowed"},"No",0,0]
["Select","-","-","-","-","DD/MM/YYYY","DD/MM/YYYY","Select","Select",{"$f":"VLOOKUP(Table1[[#This Row],[DCYF Case Region]],'Drop Down'!$F$3:$G$9,2,0)","v":"Select"},"Select","Select","Select",{"$f":"IFERROR(IF(M73=\"No\",INDEX(IndexMatch!C:C,MATCH(1,(IndexMatch!A:A=VLOOKUP(H73,'Drop Down'!K:L,2,0))*(IndexMatch!B:B=L73),0)),\"Service Already Opened\"),\"N/A\")","v":"Service Already Opened"},0,{"$f":"IF(O73>VLOOKUP(L73,'Drop Down'!$A$3:$B$10,2,0),\"1\",\"0\")","v":"0"},0,{"$f":"SUM(Table1[[#This Row],[Case Aide Hours]],Table1[[#This Row],[Case Aide Travel Time]])","v":0},{"$f":"IFERROR(IF(OR(Table1[[#This Row],[Child Support Level]]=\"Support Services Lvl 1\", Table1[[#This Row],[Child Support Level]]=\"Support Services Lvl 2\",Table1[[#This Row],[Child Support Level]]=\"Select\"),\"Case Aid Not Allowed\", PRODUCT(Table1[[#This Row],[Total Case Aide]],VLOOKUP(Table1[[#This Row],[County Where Youth Resides]],'Drop Down'!K:M,3,0))),\"0\")","v":"Case Aid Not Allowed"},"No",0,0]
["Select","-","-","-","-","DD/MM/YYYY","DD/MM/YYYY","Select","Select",{"$f":"VLOOKUP(Table1[[#This Row],[DCYF Case Region]],'Drop Down'!$F$3:$G$9,2,0)","v":"Select"},"Select","Select","Select",{"$f":"IFERROR(IF(M74=\"No\",INDEX(IndexMatch!C:C,MATCH(1,(IndexMatch!A:A=VLOOKUP(H74,'Drop Down'!K:L,2,0))*(IndexMatch!B:B=L74),0)),\"Service Already Opened\"),\"N/A\")","v":"Service Already Opened"},0,{"$f":"IF(O74>VLOOKUP(L74,'Drop Down'!$A$3:$B$10,2,0),\"1\",\"0\")","v":"0"},0,{"$f":"SUM(Table1[[#This Row],[Case Aide Hours]],Table1[[#This Row],[Case Aide Travel Time]])","v":0},{"$f":"IFERROR(IF(OR(Table1[[#This Row],[Child Support Level]]=\"Support Services Lvl 1\", Table1[[#This Row],[Child Support Level]]=\"Support Services Lvl 2\",Table1[[#This Row],[Child Support Level]]=\"Select\"),\"Case Aid Not Allowed\", PRODUCT(Table1[[#This Row],[Total Case Aide]],VLOOKUP(Table1[[#This Row],[County Where Youth Resides]],'Drop Down'!K:M,3,0))),\"0\")","v":"Case Aid Not Allowed"},"No",0,0]
["Select","-","-","-","-","DD/MM/YYYY","DD/MM/YYYY","Select","Select",{"$f":"VLOOKUP(Table1[[#This Row],[DCYF Case Region]],'Drop Down'!$F$3:$G$9,2,0)","v":"Select"},"Select","Select","Select",{"$f":"IFERROR(IF(M75=\"No\",INDEX(IndexMatch!C:C,MATCH(1,(IndexMatch!A:A=VLOOKUP(H75,'Drop Down'!K:L,2,0))*(IndexMatch!B:B=L75),0)),\"Service Already Opened\"),\"N/A\")","v":"Service Already Opened"},0,{"$f":"IF(O75>VLOOKUP(L75,'Drop Down'!$A$3:$B$10,2,0),\"1\",\"0\")","v":"0"},0,{"$f":"SUM(Table1[[#This Row],[Case Aide Hours]],Table1[[#This Row],[Case Aide Travel Time]])","v":0},{"$f":"IFERROR(IF(OR(Table1[[#This Row],[Child Support Level]]=\"Support Services Lvl 1\", Table1[[#This Row],[Child Support Level]]=\"Support Services Lvl 2\",Table1[[#This Row],[Child Support Level]]=\"Select\"),\"Case Aid Not Allowed\", PRODUCT(Table1[[#This Row],[Total Case Aide]],VLOOKUP(Table1[[#This Row],[County Where Youth Resides]],'Drop Down'!K:M,3,0))),\"0\")","v":"Case Aid Not Allowed"},"No",0,0]
["Select","-","-","-","-","DD/MM/YYYY","DD/MM/YYYY","Select","Select",{"$f":"VLOOKUP(Table1[[#This Row],[DCYF Case Region]],'Drop Down'!$F$3:$G$9,2,0)","v":"Select"},"Select","Select","Select",{"$f":"IFERROR(IF(M76=\"No\",INDEX(IndexMatch!C:C,MATCH(1,(IndexMatch!A:A=VLOOKUP(H76,'Drop Down'!K:L,2,0))*(IndexMatch!B:B=L76),0)),\"Service Already Opened\"),\"N/A\")","v":"Service Already Opened"},0,{"$f":"IF(O76>VLOOKUP(L76,'Drop Down'!$A$3:$B$10,2,0),\"1\",\"0\")","v":"0"},0,{"$f":"SUM(Table1[[#This Row],[Case Aide Hours]],Table1[[#This Row],[Case Aide Travel Time]])","v":0},{"$f":"IFERROR(IF(OR(Table1[[#This Row],[Child Support Level]]=\"Support Services Lvl 1\", Table1[[#This Row],[Child Support Level]]=\"Support Services Lvl 2\",Table1[[#This Row],[Child Support Level]]=\"Select\"),\"Case Aid Not Allowed\", PRODUCT(Table1[[#This Row],[Total Case Aide]],VLOOKUP(Table1[[#This Row],[County Where Youth Resides]],'Drop Down'!K:M,3,0))),\"0\")","v":"Case Aid Not Allowed"},"No",0,0]
["Select","-","-","-","-","DD/MM/YYYY","DD/MM/YYYY","Select","Select",{"$f":"VLOOKUP(Table1[[#This Row],[DCYF Case Region]],'Drop Down'!$F$3:$G$9,2,0)","v":"Select"},"Select","Select","Select",{"$f":"IFERROR(IF(M77=\"No\",INDEX(IndexMatch!C:C,MATCH(1,(IndexMatch!A:A=VLOOKUP(H77,'Drop Down'!K:L,2,0))*(IndexMatch!B:B=L77),0)),\"Service Already Opened\"),\"N/A\")","v":"Service Already Opened"},0,{"$f":"IF(O77>VLOOKUP(L77,'Drop Down'!$A$3:$B$10,2,0),\"1\",\"0\")","v":"0"},0,{"$f":"SUM(Table1[[#This Row],[Case Aide Hours]],Table1[[#This Row],[Case Aide Travel Time]])","v":0},{"$f":"IFERROR(IF(OR(Table1[[#This Row],[Child Support Level]]=\"Support Services Lvl 1\", Table1[[#This Row],[Child Support Level]]=\"Support Services Lvl 2\",Table1[[#This Row],[Child Support Level]]=\"Select\"),\"Case Aid Not Allowed\", PRODUCT(Table1[[#This Row],[Total Case Aide]],VLOOKUP(Table1[[#This Row],[County Where Youth Resides]],'Drop Down'!K:M,3,0))),\"0\")","v":"Case Aid Not Allowed"},"No",0,0]
["Select","-","-","-","-","DD/MM/YYYY","DD/MM/YYYY","Select","Select",{"$f":"VLOOKUP(Table1[[#This Row],[DCYF Case Region]],'Drop Down'!$F$3:$G$9,2,0)","v":"Select"},"Select","Select","Select",{"$f":"IFERROR(IF(M78=\"No\",INDEX(IndexMatch!C:C,MATCH(1,(IndexMatch!A:A=VLOOKUP(H78,'Drop Down'!K:L,2,0))*(IndexMatch!B:B=L78),0)),\"Service Already Opened\"),\"N/A\")","v":"Service Already Opened"},0,{"$f":"IF(O78>VLOOKUP(L78,'Drop Down'!$A$3:$B$10,2,0),\"1\",\"0\")","v":"0"},0,{"$f":"SUM(Table1[[#This Row],[Case Aide Hours]],Table1[[#This Row],[Case Aide Travel Time]])","v":0},{"$f":"IFERROR(IF(OR(Table1[[#This Row],[Child Support Level]]=\"Support Services Lvl 1\", Table1[[#This Row],[Child Support Level]]=\"Support Services Lvl 2\",Table1[[#This Row],[Child Support Level]]=\"Select\"),\"Case Aid Not Allowed\", PRODUCT(Table1[[#This Row],[Total Case Aide]],VLOOKUP(Table1[[#This Row],[County Where Youth Resides]],'Drop Down'!K:M,3,0))),\"0\")","v":"Case Aid Not Allowed"},"No",0,0]
["Select","-","-","-","-","DD/MM/YYYY","DD/MM/YYYY","Select","Select",{"$f":"VLOOKUP(Table1[[#This Row],[DCYF Case Region]],'Drop Down'!$F$3:$G$9,2,0)","v":"Select"},"Select","Select","Select",{"$f":"IFERROR(IF(M79=\"No\",INDEX(IndexMatch!C:C,MATCH(1,(IndexMatch!A:A=VLOOKUP(H79,'Drop Down'!K:L,2,0))*(IndexMatch!B:B=L79),0)),\"Service Already Opened\"),\"N/A\")","v":"Service Already Opened"},0,{"$f":"IF(O79>VLOOKUP(L79,'Drop Down'!$A$3:$B$10,2,0),\"1\",\"0\")","v":"0"},0,{"$f":"SUM(Table1[[#This Row],[Case Aide Hours]],Table1[[#This Row],[Case Aide Travel Time]])","v":0},{"$f":"IFERROR(IF(OR(Table1[[#This Row],[Child Support Level]]=\"Support Services Lvl 1\", Table1[[#This Row],[Child Support Level]]=\"Support Services Lvl 2\",Table1[[#This Row],[Child Support Level]]=\"Select\"),\"Case Aid Not Allowed\", PRODUCT(Table1[[#This Row],[Total Case Aide]],VLOOKUP(Table1[[#This Row],[County Where Youth Resides]],'Drop Down'!K:M,3,0))),\"0\")","v":"Case Aid Not Allowed"},"No",0,0]
["Select","-","-","-","-","DD/MM/YYYY","DD/MM/YYYY","Select","Select",{"$f":"VLOOKUP(Table1[[#This Row],[DCYF Case Region]],'Drop Down'!$F$3:$G$9,2,0)","v":"Select"},"Select","Select","Select",{"$f":"IFERROR(IF(M80=\"No\",INDEX(IndexMatch!C:C,MATCH(1,(IndexMatch!A:A=VLOOKUP(H80,'Drop Down'!K:L,2,0))*(IndexMatch!B:B=L80),0)),\"Service Already Opened\"),\"N/A\")","v":"Service Already Opened"},0,{"$f":"IF(O80>VLOOKUP(L80,'Drop Down'!$A$3:$B$10,2,0),\"1\",\"0\")","v":"0"},0,{"$f":"SUM(Table1[[#This Row],[Case Aide Hours]],Table1[[#This Row],[Case Aide Travel Time]])","v":0},{"$f":"IFERROR(IF(OR(Table1[[#This Row],[Child Support Level]]=\"Support Services Lvl 1\", Table1[[#This Row],[Child Support Level]]=\"Support Services Lvl 2\",Table1[[#This Row],[Child Support Level]]=\"Select\"),\"Case Aid Not Allowed\", PRODUCT(Table1[[#This Row],[Total Case Aide]],VLOOKUP(Table1[[#This Row],[County Where Youth Resides]],'Drop Down'!K:M,3,0))),\"0\")","v":"Case Aid Not Allowed"},"No",0,0]
["Select","-","-","-","-","DD/MM/YYYY","DD/MM/YYYY","Select","Select",{"$f":"VLOOKUP(Table1[[#This Row],[DCYF Case Region]],'Drop Down'!$F$3:$G$9,2,0)","v":"Select"},"Select","Select","Select",{"$f":"IFERROR(IF(M81=\"No\",INDEX(IndexMatch!C:C,MATCH(1,(IndexMatch!A:A=VLOOKUP(H81,'Drop Down'!K:L,2,0))*(IndexMatch!B:B=L81),0)),\"Service Already Opened\"),\"N/A\")","v":"Service Already Opened"},0,{"$f":"IF(O81>VLOOKUP(L81,'Drop Down'!$A$3:$B$10,2,0),\"1\",\"0\")","v":"0"},0,{"$f":"SUM(Table1[[#This Row],[Case Aide Hours]],Table1[[#This Row],[Case Aide Travel Time]])","v":0},{"$f":"IFERROR(IF(OR(Table1[[#This Row],[Child Support Level]]=\"Support Services Lvl 1\", Table1[[#This Row],[Child Support Level]]=\"Support Services Lvl 2\",Table1[[#This Row],[Child Support Level]]=\"Select\"),\"Case Aid Not Allowed\", PRODUCT(Table1[[#This Row],[Total Case Aide]],VLOOKUP(Table1[[#This Row],[County Where Youth Resides]],'Drop Down'!K:M,3,0))),\"0\")","v":"Case Aid Not Allowed"},"No",0,0]
["Select","-","-","-","-","DD/MM/YYYY","DD/MM/YYYY","Select","Select",{"$f":"VLOOKUP(Table1[[#This Row],[DCYF Case Region]],'Drop Down'!$F$3:$G$9,2,0)","v":"Select"},"Select","Select","Select",{"$f":"IFERROR(IF(M82=\"No\",INDEX(IndexMatch!C:C,MATCH(1,(IndexMatch!A:A=VLOOKUP(H82,'Drop Down'!K:L,2,0))*(IndexMatch!B:B=L82),0)),\"Service Already Opened\"),\"N/A\")","v":"Service Already Opened"},0,{"$f":"IF(O82>VLOOKUP(L82,'Drop Down'!$A$3:$B$10,2,0),\"1\",\"0\")","v":"0"},0,{"$f":"SUM(Table1[[#This Row],[Case Aide Hours]],Table1[[#This Row],[Case Aide Travel Time]])","v":0},{"$f":"IFERROR(IF(OR(Table1[[#This Row],[Child Support Level]]=\"Support Services Lvl 1\", Table1[[#This Row],[Child Support Level]]=\"Support Services Lvl 2\",Table1[[#This Row],[Child Support Level]]=\"Select\"),\"Case Aid Not Allowed\", PRODUCT(Table1[[#This Row],[Total Case Aide]],VLOOKUP(Table1[[#This Row],[County Where Youth Resides]],'Drop Down'!K:M,3,0))),\"0\")","v":"Case Aid Not Allowed"},"No",0,0]
["Select","-","-","-","-","DD/MM/YYYY","DD/MM/YYYY","Select","Select",{"$f":"VLOOKUP(Table1[[#This Row],[DCYF Case Region]],'Drop Down'!$F$3:$G$9,2,0)","v":"Select"},"Select","Select","Select",{"$f":"IFERROR(IF(M83=\"No\",INDEX(IndexMatch!C:C,MATCH(1,(IndexMatch!A:A=VLOOKUP(H83,'Drop Down'!K:L,2,0))*(IndexMatch!B:B=L83),0)),\"Service Already Opened\"),\"N/A\")","v":"Service Already Opened"},0,{"$f":"IF(O83>VLOOKUP(L83,'Drop Down'!$A$3:$B$10,2,0),\"1\",\"0\")","v":"0"},0,{"$f":"SUM(Table1[[#This Row],[Case Aide Hours]],Table1[[#This Row],[Case Aide Travel Time]])","v":0},{"$f":"IFERROR(IF(OR(Table1[[#This Row],[Child Support Level]]=\"Support Services Lvl 1\", Table1[[#This Row],[Child Support Level]]=\"Support Services Lvl 2\",Table1[[#This Row],[Child Support Level]]=\"Select\"),\"Case Aid Not Allowed\", PRODUCT(Table1[[#This Row],[Total Case Aide]],VLOOKUP(Table1[[#This Row],[County Where Youth Resides]],'Drop Down'!K:M,3,0))),\"0\")","v":"Case Aid Not Allowed"},"No",0,0]
["Select","-","-","-","-","DD/MM/YYYY","DD/MM/YYYY","Select","Select",{"$f":"VLOOKUP(Table1[[#This Row],[DCYF Case Region]],'Drop Down'!$F$3:$G$9,2,0)","v":"Select"},"Select","Select","Select",{"$f":"IFERROR(IF(M84=\"No\",INDEX(IndexMatch!C:C,MATCH(1,(IndexMatch!A:A=VLOOKUP(H84,'Drop Down'!K:L,2,0))*(IndexMatch!B:B=L84),0)),\"Service Already Opened\"),\"N/A\")","v":"Service Already Opened"},0,{"$f":"IF(O84>VLOOKUP(L84,'Drop Down'!$A$3:$B$10,2,0),\"1\",\"0\")","v":"0"},0,{"$f":"SUM(Table1[[#This Row],[Case Aide Hours]],Table1[[#This Row],[Case Aide Travel Time]])","v":0},{"$f":"IFERROR(IF(OR(Table1[[#This Row],[Child Support Level]]=\"Support Services Lvl 1\", Table1[[#This Row],[Child Support Level]]=\"Support Services Lvl 2\",Table1[[#This Row],[Child Support Level]]=\"Select\"),\"Case Aid Not Allowed\", PRODUCT(Table1[[#This Row],[Total Case Aide]],VLOOKUP(Table1[[#This Row],[County Where Youth Resides]],'Drop Down'!K:M,3,0))),\"0\")","v":"Case Aid Not Allowed"},"No",0,0]
["Select","-","-","-","-","DD/MM/YYYY","DD/MM/YYYY","Select","Select",{"$f":"VLOOKUP(Table1[[#This Row],[DCYF Case Region]],'Drop Down'!$F$3:$G$9,2,0)","v":"Select"},"Select","Select","Select",{"$f":"IFERROR(IF(M85=\"No\",INDEX(IndexMatch!C:C,MATCH(1,(IndexMatch!A:A=VLOOKUP(H85,'Drop Down'!K:L,2,0))*(IndexMatch!B:B=L85),0)),\"Service Already Opened\"),\"N/A\")","v":"Service Already Opened"},0,{"$f":"IF(O85>VLOOKUP(L85,'Drop Down'!$A$3:$B$10,2,0),\"1\",\"0\")","v":"0"},0,{"$f":"SUM(Table1[[#This Row],[Case Aide Hours]],Table1[[#This Row],[Case Aide Travel Time]])","v":0},{"$f":"IFERROR(IF(OR(Table1[[#This Row],[Child Support Level]]=\"Support Services Lvl 1\", Table1[[#This Row],[Child Support Level]]=\"Support Services Lvl 2\",Table1[[#This Row],[Child Support Level]]=\"Select\"),\"Case Aid Not Allowed\", PRODUCT(Table1[[#This Row],[Total Case Aide]],VLOOKUP(Table1[[#This Row],[County Where Youth Resides]],'Drop Down'!K:M,3,0))),\"0\")","v":"Case Aid Not Allowed"},"No",0,0]
["Select","-","-","-","-","DD/MM/YYYY","DD/MM/YYYY","Select","Select",{"$f":"VLOOKUP(Table1[[#This Row],[DCYF Case Region]],'Drop Down'!$F$3:$G$9,2,0)","v":"Select"},"Select","Select","Select",{"$f":"IFERROR(IF(M86=\"No\",INDEX(IndexMatch!C:C,MATCH(1,(IndexMatch!A:A=VLOOKUP(H86,'Drop Down'!K:L,2,0))*(IndexMatch!B:B=L86),0)),\"Service Already Opened\"),\"N/A\")","v":"Service Already Opened"},0,{"$f":"IF(O86>VLOOKUP(L86,'Drop Down'!$A$3:$B$10,2,0),\"1\",\"0\")","v":"0"},0,{"$f":"SUM(Table1[[#This Row],[Case Aide Hours]],Table1[[#This Row],[Case Aide Travel Time]])","v":0},{"$f":"IFERROR(IF(OR(Table1[[#This Row],[Child Support Level]]=\"Support Services Lvl 1\", Table1[[#This Row],[Child Support Level]]=\"Support Services Lvl 2\",Table1[[#This Row],[Child Support Level]]=\"Select\"),\"Case Aid Not Allowed\", PRODUCT(Table1[[#This Row],[Total Case Aide]],VLOOKUP(Table1[[#This Row],[County Where Youth Resides]],'Drop Down'!K:M,3,0))),\"0\")","v":"Case Aid Not Allowed"},"No",0,0]
["Select","-","-","-","-","DD/MM/YYYY","DD/MM/YYYY","Select","Select",{"$f":"VLOOKUP(Table1[[#This Row],[DCYF Case Region]],'Drop Down'!$F$3:$G$9,2,0)","v":"Select"},"Select","Select","Select",{"$f":"IFERROR(IF(M87=\"No\",INDEX(IndexMatch!C:C,MATCH(1,(IndexMatch!A:A=VLOOKUP(H87,'Drop Down'!K:L,2,0))*(IndexMatch!B:B=L87),0)),\"Service Already Opened\"),\"N/A\")","v":"Service Already Opened"},0,{"$f":"IF(O87>VLOOKUP(L87,'Drop Down'!$A$3:$B$10,2,0),\"1\",\"0\")","v":"0"},0,{"$f":"SUM(Table1[[#This Row],[Case Aide Hours]],Table1[[#This Row],[Case Aide Travel Time]])","v":0},{"$f":"IFERROR(IF(OR(Table1[[#This Row],[Child Support Level]]=\"Support Services Lvl 1\", Table1[[#This Row],[Child Support Level]]=\"Support Services Lvl 2\",Table1[[#This Row],[Child Support Level]]=\"Select\"),\"Case Aid Not Allowed\", PRODUCT(Table1[[#This Row],[Total Case Aide]],VLOOKUP(Table1[[#This Row],[County Where Youth Resides]],'Drop Down'!K:M,3,0))),\"0\")","v":"Case Aid Not Allowed"},"No",0,0]
["Select","-","-","-","-","DD/MM/YYYY","DD/MM/YYYY","Select","Select",{"$f":"VLOOKUP(Table1[[#This Row],[DCYF Case Region]],'Drop Down'!$F$3:$G$9,2,0)","v":"Select"},"Select","Select","Select",{"$f":"IFERROR(IF(M88=\"No\",INDEX(IndexMatch!C:C,MATCH(1,(IndexMatch!A:A=VLOOKUP(H88,'Drop Down'!K:L,2,0))*(IndexMatch!B:B=L88),0)),\"Service Already Opened\"),\"N/A\")","v":"Service Already Opened"},0,{"$f":"IF(O88>VLOOKUP(L88,'Drop Down'!$A$3:$B$10,2,0),\"1\",\"0\")","v":"0"},0,{"$f":"SUM(Table1[[#This Row],[Case Aide Hours]],Table1[[#This Row],[Case Aide Travel Time]])","v":0},{"$f":"IFERROR(IF(OR(Table1[[#This Row],[Child Support Level]]=\"Support Services Lvl 1\", Table1[[#This Row],[Child Support Level]]=\"Support Services Lvl 2\",Table1[[#This Row],[Child Support Level]]=\"Select\"),\"Case Aid Not Allowed\", PRODUCT(Table1[[#This Row],[Total Case Aide]],VLOOKUP(Table1[[#This Row],[County Where Youth Resides]],'Drop Down'!K:M,3,0))),\"0\")","v":"Case Aid Not Allowed"},"No",0,0]
["Select","-","-","-","-","DD/MM/YYYY","DD/MM/YYYY","Select","Select",{"$f":"VLOOKUP(Table1[[#This Row],[DCYF Case Region]],'Drop Down'!$F$3:$G$9,2,0)","v":"Select"},"Select","Select","Select",{"$f":"IFERROR(IF(M89=\"No\",INDEX(IndexMatch!C:C,MATCH(1,(IndexMatch!A:A=VLOOKUP(H89,'Drop Down'!K:L,2,0))*(IndexMatch!B:B=L89),0)),\"Service Already Opened\"),\"N/A\")","v":"Service Already Opened"},0,{"$f":"IF(O89>VLOOKUP(L89,'Drop Down'!$A$3:$B$10,2,0),\"1\",\"0\")","v":"0"},0,{"$f":"SUM(Table1[[#This Row],[Case Aide Hours]],Table1[[#This Row],[Case Aide Travel Time]])","v":0},{"$f":"IFERROR(IF(OR(Table1[[#This Row],[Child Support Level]]=\"Support Services Lvl 1\", Table1[[#This Row],[Child Support Level]]=\"Support Services Lvl 2\",Table1[[#This Row],[Child Support Level]]=\"Select\"),\"Case Aid Not Allowed\", PRODUCT(Table1[[#This Row],[Total Case Aide]],VLOOKUP(Table1[[#This Row],[County Where Youth Resides]],'Drop Down'!K:M,3,0))),\"0\")","v":"Case Aid Not Allowed"},"No",0,0]
["Select","-","-","-","-","DD/MM/YYYY","DD/MM/YYYY","Select","Select",{"$f":"VLOOKUP(Table1[[#This Row],[DCYF Case Region]],'Drop Down'!$F$3:$G$9,2,0)","v":"Select"},"Select","Select","Select",{"$f":"IFERROR(IF(M90=\"No\",INDEX(IndexMatch!C:C,MATCH(1,(IndexMatch!A:A=VLOOKUP(H90,'Drop Down'!K:L,2,0))*(IndexMatch!B:B=L90),0)),\"Service Already Opened\"),\"N/A\")","v":"Service Already Opened"},0,{"$f":"IF(O90>VLOOKUP(L90,'Drop Down'!$A$3:$B$10,2,0),\"1\",\"0\")","v":"0"},0,{"$f":"SUM(Table1[[#This Row],[Case Aide Hours]],Table1[[#This Row],[Case Aide Travel Time]])","v":0},{"$f":"IFERROR(IF(OR(Table1[[#This Row],[Child Support Level]]=\"Support Services Lvl 1\", Table1[[#This Row],[Child Support Level]]=\"Support Services Lvl 2\",Table1[[#This Row],[Child Support Level]]=\"Select\"),\"Case Aid Not Allowed\", PRODUCT(Table1[[#This Row],[Total Case Aide]],VLOOKUP(Table1[[#This Row],[County Where Youth Resides]],'Drop Down'!K:M,3,0))),\"0\")","v":"Case Aid Not Allowed"},"No",0,0]
["Select","-","-","-","-","DD/MM/YYYY","DD/MM/YYYY","Select","Select",{"$f":"VLOOKUP(Table1[[#This Row],[DCYF Case Region]],'Drop Down'!$F$3:$G$9,2,0)","v":"Select"},"Select","Select","Select",{"$f":"IFERROR(IF(M91=\"No\",INDEX(IndexMatch!C:C,MATCH(1,(IndexMatch!A:A=VLOOKUP(H91,'Drop Down'!K:L,2,0))*(IndexMatch!B:B=L91),0)),\"Service Already Opened\"),\"N/A\")","v":"Service Already Opened"},0,{"$f":"IF(O91>VLOOKUP(L91,'Drop Down'!$A$3:$B$10,2,0),\"1\",\"0\")","v":"0"},0,{"$f":"SUM(Table1[[#This Row],[Case Aide Hours]],Table1[[#This Row],[Case Aide Travel Time]])","v":0},{"$f":"IFERROR(IF(OR(Table1[[#This Row],[Child Support Level]]=\"Support Services Lvl 1\", Table1[[#This Row],[Child Support Level]]=\"Support Services Lvl 2\",Table1[[#This Row],[Child Support Level]]=\"Select\"),\"Case Aid Not Allowed\", PRODUCT(Table1[[#This Row],[Total Case Aide]],VLOOKUP(Table1[[#This Row],[County Where Youth Resides]],'Drop Down'!K:M,3,0))),\"0\")","v":"Case Aid Not Allowed"},"No",0,0]
["Select","-","-","-","-","DD/MM/YYYY","DD/MM/YYYY","Select","Select",{"$f":"VLOOKUP(Table1[[#This Row],[DCYF Case Region]],'Drop Down'!$F$3:$G$9,2,0)","v":"Select"},"Select","Select","Select",{"$f":"IFERROR(IF(M92=\"No\",INDEX(IndexMatch!C:C,MATCH(1,(IndexMatch!A:A=VLOOKUP(H92,'Drop Down'!K:L,2,0))*(IndexMatch!B:B=L92),0)),\"Service Already Opened\"),\"N/A\")","v":"Service Already Opened"},0,{"$f":"IF(O92>VLOOKUP(L92,'Drop Down'!$A$3:$B$10,2,0),\"1\",\"0\")","v":"0"},0,{"$f":"SUM(Table1[[#This Row],[Case Aide Hours]],Table1[[#This Row],[Case Aide Travel Time]])","v":0},{"$f":"IFERROR(IF(OR(Table1[[#This Row],[Child Support Level]]=\"Support Services Lvl 1\", Table1[[#This Row],[Child Support Level]]=\"Support Services Lvl 2\",Table1[[#This Row],[Child Support Level]]=\"Select\"),\"Case Aid Not Allowed\", PRODUCT(Table1[[#This Row],[Total Case Aide]],VLOOKUP(Table1[[#This Row],[County Where Youth Resides]],'Drop Down'!K:M,3,0))),\"0\")","v":"Case Aid Not Allowed"},"No",0,0]
["Select","-","-","-","-","DD/MM/YYYY","DD/MM/YYYY","Select","Select",{"$f":"VLOOKUP(Table1[[#This Row],[DCYF Case Region]],'Drop Down'!$F$3:$G$9,2,0)","v":"Select"},"Select","Select","Select",{"$f":"IFERROR(IF(M93=\"No\",INDEX(IndexMatch!C:C,MATCH(1,(IndexMatch!A:A=VLOOKUP(H93,'Drop Down'!K:L,2,0))*(IndexMatch!B:B=L93),0)),\"Service Already Opened\"),\"N/A\")","v":"Service Already Opened"},0,{"$f":"IF(O93>VLOOKUP(L93,'Drop Down'!$A$3:$B$10,2,0),\"1\",\"0\")","v":"0"},0,{"$f":"SUM(Table1[[#This Row],[Case Aide Hours]],Table1[[#This Row],[Case Aide Travel Time]])","v":0},{"$f":"IFERROR(IF(OR(Table1[[#This Row],[Child Support Level]]=\"Support Services Lvl 1\", Table1[[#This Row],[Child Support Level]]=\"Support Services Lvl 2\",Table1[[#This Row],[Child Support Level]]=\"Select\"),\"Case Aid Not Allowed\", PRODUCT(Table1[[#This Row],[Total Case Aide]],VLOOKUP(Table1[[#This Row],[County Where Youth Resides]],'Drop Down'!K:M,3,0))),\"0\")","v":"Case Aid Not Allowed"},"No",0,0]
["Select","-","-","-","-","DD/MM/YYYY","DD/MM/YYYY","Select","Select",{"$f":"VLOOKUP(Table1[[#This Row],[DCYF Case Region]],'Drop Down'!$F$3:$G$9,2,0)","v":"Select"},"Select","Select","Select",{"$f":"IFERROR(IF(M94=\"No\",INDEX(IndexMatch!C:C,MATCH(1,(IndexMatch!A:A=VLOOKUP(H94,'Drop Down'!K:L,2,0))*(IndexMatch!B:B=L94),0)),\"Service Already Opened\"),\"N/A\")","v":"Service Already Opened"},0,{"$f":"IF(O94>VLOOKUP(L94,'Drop Down'!$A$3:$B$10,2,0),\"1\",\"0\")","v":"0"},0,{"$f":"SUM(Table1[[#This Row],[Case Aide Hours]],Table1[[#This Row],[Case Aide Travel Time]])","v":0},{"$f":"IFERROR(IF(OR(Table1[[#This Row],[Child Support Level]]=\"Support Services Lvl 1\", Table1[[#This Row],[Child Support Level]]=\"Support Services Lvl 2\",Table1[[#This Row],[Child Support Level]]=\"Select\"),\"Case Aid Not Allowed\", PRODUCT(Table1[[#This Row],[Total Case Aide]],VLOOKUP(Table1[[#This Row],[County Where Youth Resides]],'Drop Down'!K:M,3,0))),\"0\")","v":"Case Aid Not Allowed"},"No",0,0]
["Select","-","-","-","-","DD/MM/YYYY","DD/MM/YYYY","Select","Select",{"$f":"VLOOKUP(Table1[[#This Row],[DCYF Case Region]],'Drop Down'!$F$3:$G$9,2,0)","v":"Select"},"Select","Select","Select",{"$f":"IFERROR(IF(M95=\"No\",INDEX(IndexMatch!C:C,MATCH(1,(IndexMatch!A:A=VLOOKUP(H95,'Drop Down'!K:L,2,0))*(IndexMatch!B:B=L95),0)),\"Service Already Opened\"),\"N/A\")","v":"Service Already Opened"},0,{"$f":"IF(O95>VLOOKUP(L95,'Drop Down'!$A$3:$B$10,2,0),\"1\",\"0\")","v":"0"},0,{"$f":"SUM(Table1[[#This Row],[Case Aide Hours]],Table1[[#This Row],[Case Aide Travel Time]])","v":0},{"$f":"IFERROR(IF(OR(Table1[[#This Row],[Child Support Level]]=\"Support Services Lvl 1\", Table1[[#This Row],[Child Support Level]]=\"Support Services Lvl 2\",Table1[[#This Row],[Child Support Level]]=\"Select\"),\"Case Aid Not Allowed\", PRODUCT(Table1[[#This Row],[Total Case Aide]],VLOOKUP(Table1[[#This Row],[County Where Youth Resides]],'Drop Down'!K:M,3,0))),\"0\")","v":"Case Aid Not Allowed"},"No",0,0]
["Select","-","-","-","-","DD/MM/YYYY","DD/MM/YYYY","Select","Select",{"$f":"VLOOKUP(Table1[[#This Row],[DCYF Case Region]],'Drop Down'!$F$3:$G$9,2,0)","v":"Select"},"Select","Select","Select",{"$f":"IFERROR(IF(M96=\"No\",INDEX(IndexMatch!C:C,MATCH(1,(IndexMatch!A:A=VLOOKUP(H96,'Drop Down'!K:L,2,0))*(IndexMatch!B:B=L96),0)),\"Service Already Opened\"),\"N/A\")","v":"Service Already Opened"},0,{"$f":"IF(O96>VLOOKUP(L96,'Drop Down'!$A$3:$B$10,2,0),\"1\",\"0\")","v":"0"},0,{"$f":"SUM(Table1[[#This Row],[Case Aide Hours]],Table1[[#This Row],[Case Aide Travel Time]])","v":0},{"$f":"IFERROR(IF(OR(Table1[[#This Row],[Child Support Level]]=\"Support Services Lvl 1\", Table1[[#This Row],[Child Support Level]]=\"Support Services Lvl 2\",Table1[[#This Row],[Child Support Level]]=\"Select\"),\"Case Aid Not Allowed\", PRODUCT(Table1[[#This Row],[Total Case Aide]],VLOOKUP(Table1[[#This Row],[County Where Youth Resides]],'Drop Down'!K:M,3,0))),\"0\")","v":"Case Aid Not Allowed"},"No",0,0]
["Select","-","-","-","-","DD/MM/YYYY","DD/MM/YYYY","Select","Select",{"$f":"VLOOKUP(Table1[[#This Row],[DCYF Case Region]],'Drop Down'!$F$3:$G$9,2,0)","v":"Select"},"Select","Select","Select",{"$f":"IFERROR(IF(M97=\"No\",INDEX(IndexMatch!C:C,MATCH(1,(IndexMatch!A:A=VLOOKUP(H97,'Drop Down'!K:L,2,0))*(IndexMatch!B:B=L97),0)),\"Service Already Opened\"),\"N/A\")","v":"Service Already Opened"},0,{"$f":"IF(O97>VLOOKUP(L97,'Drop Down'!$A$3:$B$10,2,0),\"1\",\"0\")","v":"0"},0,{"$f":"SUM(Table1[[#This Row],[Case Aide Hours]],Table1[[#This Row],[Case Aide Travel Time]])","v":0},{"$f":"IFERROR(IF(OR(Table1[[#This Row],[Child Support Level]]=\"Support Services Lvl 1\", Table1[[#This Row],[Child Support Level]]=\"Support Services Lvl 2\",Table1[[#This Row],[Child Support Level]]=\"Select\"),\"Case Aid Not Allowed\", PRODUCT(Table1[[#This Row],[Total Case Aide]],VLOOKUP(Table1[[#This Row],[County Where Youth Resides]],'Drop Down'!K:M,3,0))),\"0\")","v":"Case Aid Not Allowed"},"No",0,0]
["Select","-","-","-","-","DD/MM/YYYY","DD/MM/YYYY","Select","Select",{"$f":"VLOOKUP(Table1[[#This Row],[DCYF Case Region]],'Drop Down'!$F$3:$G$9,2,0)","v":"Select"},"Select","Select","Select",{"$f":"IFERROR(IF(M98=\"No\",INDEX(IndexMatch!C:C,MATCH(1,(IndexMatch!A:A=VLOOKUP(H98,'Drop Down'!K:L,2,0))*(IndexMatch!B:B=L98),0)),\"Service Already Opened\"),\"N/A\")","v":"Service Already Opened"},0,{"$f":"IF(O98>VLOOKUP(L98,'Drop Down'!$A$3:$B$10,2,0),\"1\",\"0\")","v":"0"},0,{"$f":"SUM(Table1[[#This Row],[Case Aide Hours]],Table1[[#This Row],[Case Aide Travel Time]])","v":0},{"$f":"IFERROR(IF(OR(Table1[[#This Row],[Child Support Level]]=\"Support Services Lvl 1\", Table1[[#This Row],[Child Support Level]]=\"Support Services Lvl 2\",Table1[[#This Row],[Child Support Level]]=\"Select\"),\"Case Aid Not Allowed\", PRODUCT(Table1[[#This Row],[Total Case Aide]],VLOOKUP(Table1[[#This Row],[County Where Youth Resides]],'Drop Down'!K:M,3,0))),\"0\")","v":"Case Aid Not Allowed"},"No",0,0]
["Select","-","-","-","-","DD/MM/YYYY","DD/MM/YYYY","Select","Select",{"$f":"VLOOKUP(Table1[[#This Row],[DCYF Case Region]],'Drop Down'!$F$3:$G$9,2,0)","v":"Select"},"Select","Select","Select",{"$f":"IFERROR(IF(M99=\"No\",INDEX(IndexMatch!C:C,MATCH(1,(IndexMatch!A:A=VLOOKUP(H99,'Drop Down'!K:L,2,0))*(IndexMatch!B:B=L99),0)),\"Service Already Opened\"),\"N/A\")","v":"Service Already Opened"},0,{"$f":"IF(O99>VLOOKUP(L99,'Drop Down'!$A$3:$B$10,2,0),\"1\",\"0\")","v":"0"},0,{"$f":"SUM(Table1[[#This Row],[Case Aide Hours]],Table1[[#This Row],[Case Aide Travel Time]])","v":0},{"$f":"IFERROR(IF(OR(Table1[[#This Row],[Child Support Level]]=\"Support Services Lvl 1\", Table1[[#This Row],[Child Support Level]]=\"Support Services Lvl 2\",Table1[[#This Row],[Child Support Level]]=\"Select\"),\"Case Aid Not Allowed\", PRODUCT(Table1[[#This Row],[Total Case Aide]],VLOOKUP(Table1[[#This Row],[County Where Youth Resides]],'Drop Down'!K:M,3,0))),\"0\")","v":"Case Aid Not Allowed"},"No",0,0]
["Select","-","-","-","-","DD/MM/YYYY","DD/MM/YYYY","Select","Select",{"$f":"VLOOKUP(Table1[[#This Row],[DCYF Case Region]],'Drop Down'!$F$3:$G$9,2,0)","v":"Select"},"Select","Select","Select",{"$f":"IFERROR(IF(M100=\"No\",INDEX(IndexMatch!C:C,MATCH(1,(IndexMatch!A:A=VLOOKUP(H100,'Drop Down'!K:L,2,0))*(IndexMatch!B:B=L100),0)),\"Service Already Opened\"),\"N/A\")","v":"Service Already Opened"},0,{"$f":"IF(O100>VLOOKUP(L100,'Drop Down'!$A$3:$B$10,2,0),\"1\",\"0\")","v":"0"},0,{"$f":"SUM(Table1[[#This Row],[Case Aide Hours]],Table1[[#This Row],[Case Aide Travel Time]])","v":0},{"$f":"IFERROR(IF(OR(Table1[[#This Row],[Child Support Level]]=\"Support Services Lvl 1\", Table1[[#This Row],[Child Support Level]]=\"Support Services Lvl 2\",Table1[[#This Row],[Child Support Level]]=\"Select\"),\"Case Aid Not Allowed\", PRODUCT(Table1[[#This Row],[Total Case Aide]],VLOOKUP(Table1[[#This Row],[County Where Youth Resides]],'Drop Down'!K:M,3,0))),\"0\")","v":"Case Aid Not Allowed"},"No",0,0]
["Select","-","-","-","-","DD/MM/YYYY","DD/MM/YYYY","Select","Select",{"$f":"VLOOKUP(Table1[[#This Row],[DCYF Case Region]],'Drop Down'!$F$3:$G$9,2,0)","v":"Select"},"Select","Select","Select",{"$f":"IFERROR(IF(M101=\"No\",INDEX(IndexMatch!C:C,MATCH(1,(IndexMatch!A:A=VLOOKUP(H101,'Drop Down'!K:L,2,0))*(IndexMatch!B:B=L101),0)),\"Service Already Opened\"),\"N/A\")","v":"Service Already Opened"},0,{"$f":"IF(O101>VLOOKUP(L101,'Drop Down'!$A$3:$B$10,2,0),\"1\",\"0\")","v":"0"},0,{"$f":"SUM(Table1[[#This Row],[Case Aide Hours]],Table1[[#This Row],[Case Aide Travel Time]])","v":0},{"$f":"IFERROR(IF(OR(Table1[[#This Row],[Child Support Level]]=\"Support Services Lvl 1\", Table1[[#This Row],[Child Support Level]]=\"Support Services Lvl 2\",Table1[[#This Row],[Child Support Level]]=\"Select\"),\"Case Aid Not Allowed\", PRODUCT(Table1[[#This Row],[Total Case Aide]],VLOOKUP(Table1[[#This Row],[County Where Youth Resides]],'Drop Down'!K:M,3,0))),\"0\")","v":"Case Aid Not Allowed"},"No",0,0]
["Select","-","-","-","-","DD/MM/YYYY","DD/MM/YYYY","Select","Select",{"$f":"VLOOKUP(Table1[[#This Row],[DCYF Case Region]],'Drop Down'!$F$3:$G$9,2,0)","v":"Select"},"Select","Select","Select",{"$f":"IFERROR(IF(M102=\"No\",INDEX(IndexMatch!C:C,MATCH(1,(IndexMatch!A:A=VLOOKUP(H102,'Drop Down'!K:L,2,0))*(IndexMatch!B:B=L102),0)),\"Service Already Opened\"),\"N/A\")","v":"Service Already Opened"},0,{"$f":"IF(O102>VLOOKUP(L102,'Drop Down'!$A$3:$B$10,2,0),\"1\",\"0\")","v":"0"},0,{"$f":"SUM(Table1[[#This Row],[Case Aide Hours]],Table1[[#This Row],[Case Aide Travel Time]])","v":0},{"$f":"IFERROR(IF(OR(Table1[[#This Row],[Child Support Level]]=\"Support Services Lvl 1\", Table1[[#This Row],[Child Support Level]]=\"Support Services Lvl 2\",Table1[[#This Row],[Child Support Level]]=\"Select\"),\"Case Aid Not Allowed\", PRODUCT(Table1[[#This Row],[Total Case Aide]],VLOOKUP(Table1[[#This Row],[County Where Youth Resides]],'Drop Down'!K:M,3,0))),\"0\")","v":"Case Aid Not Allowed"},"No",0,0]
["Select","-","-","-","-","DD/MM/YYYY","DD/MM/YYYY","Select","Select",{"$f":"VLOOKUP(Table1[[#This Row],[DCYF Case Region]],'Drop Down'!$F$3:$G$9,2,0)","v":"Select"},"Select","Select","Select",{"$f":"IFERROR(IF(M103=\"No\",INDEX(IndexMatch!C:C,MATCH(1,(IndexMatch!A:A=VLOOKUP(H103,'Drop Down'!K:L,2,0))*(IndexMatch!B:B=L103),0)),\"Service Already Opened\"),\"N/A\")","v":"Service Already Opened"},0,{"$f":"IF(O103>VLOOKUP(L103,'Drop Down'!$A$3:$B$10,2,0),\"1\",\"0\")","v":"0"},0,{"$f":"SUM(Table1[[#This Row],[Case Aide Hours]],Table1[[#This Row],[Case Aide Travel Time]])","v":0},{"$f":"IFERROR(IF(OR(Table1[[#This Row],[Child Support Level]]=\"Support Services Lvl 1\", Table1[[#This Row],[Child Support Level]]=\"Support Services Lvl 2\",Table1[[#This Row],[Child Support Level]]=\"Select\"),\"Case Aid Not Allowed\", PRODUCT(Table1[[#This Row],[Total Case Aide]],VLOOKUP(Table1[[#This Row],[County Where Youth Resides]],'Drop Down'!K:M,3,0))),\"0\")","v":"Case Aid Not Allowed"},"No",0,0]
["Select","-","-","-","-","DD/MM/YYYY","DD/MM/YYYY","Select","Select",{"$f":"VLOOKUP(Table1[[#This Row],[DCYF Case Region]],'Drop Down'!$F$3:$G$9,2,0)","v":"Select"},"Select","Select","Select",{"$f":"IFERROR(IF(M104=\"No\",INDEX(IndexMatch!C:C,MATCH(1,(IndexMatch!A:A=VLOOKUP(H104,'Drop Down'!K:L,2,0))*(IndexMatch!B:B=L104),0)),\"Service Already Opened\"),\"N/A\")","v":"Service Already Opened"},0,{"$f":"IF(O104>VLOOKUP(L104,'Drop Down'!$A$3:$B$10,2,0),\"1\",\"0\")","v":"0"},0,{"$f":"SUM(Table1[[#This Row],[Case Aide Hours]],Table1[[#This Row],[Case Aide Travel Time]])","v":0},{"$f":"IFERROR(IF(OR(Table1[[#This Row],[Child Support Level]]=\"Support Services Lvl 1\", Table1[[#This Row],[Child Support Level]]=\"Support Services Lvl 2\",Table1[[#This Row],[Child Support Level]]=\"Select\"),\"Case Aid Not Allowed\", PRODUCT(Table1[[#This Row],[Total Case Aide]],VLOOKUP(Table1[[#This Row],[County Where Youth Resides]],'Drop Down'!K:M,3,0))),\"0\")","v":"Case Aid Not Allowed"},"No",0,0]
["Select","-","-","-","-","DD/MM/YYYY","DD/MM/YYYY","Select","Select",{"$f":"VLOOKUP(Table1[[#This Row],[DCYF Case Region]],'Drop Down'!$F$3:$G$9,2,0)","v":"Select"},"Select","Select","Select",{"$f":"IFERROR(IF(M105=\"No\",INDEX(IndexMatch!C:C,MATCH(1,(IndexMatch!A:A=VLOOKUP(H105,'Drop Down'!K:L,2,0))*(IndexMatch!B:B=L105),0)),\"Service Already Opened\"),\"N/A\")","v":"Service Already Opened"},0,{"$f":"IF(O105>VLOOKUP(L105,'Drop Down'!$A$3:$B$10,2,0),\"1\",\"0\")","v":"0"},0,{"$f":"SUM(Table1[[#This Row],[Case Aide Hours]],Table1[[#This Row],[Case Aide Travel Time]])","v":0},{"$f":"IFERROR(IF(OR(Table1[[#This Row],[Child Support Level]]=\"Support Services Lvl 1\", Table1[[#This Row],[Child Support Level]]=\"Support Services Lvl 2\",Table1[[#This Row],[Child Support Level]]=\"Select\"),\"Case Aid Not Allowed\", PRODUCT(Table1[[#This Row],[Total Case Aide]],VLOOKUP(Table1[[#This Row],[County Where Youth Resides]],'Drop Down'!K:M,3,0))),\"0\")","v":"Case Aid Not Allowed"},"No",0,0]
["Select","-","-","-","-","DD/MM/YYYY","DD/MM/YYYY","Select","Select",{"$f":"VLOOKUP(Table1[[#This Row],[DCYF Case Region]],'Drop Down'!$F$3:$G$9,2,0)","v":"Select"},"Select","Select","Select",{"$f":"IFERROR(IF(M106=\"No\",INDEX(IndexMatch!C:C,MATCH(1,(IndexMatch!A:A=VLOOKUP(H106,'Drop Down'!K:L,2,0))*(IndexMatch!B:B=L106),0)),\"Service Already Opened\"),\"N/A\")","v":"Service Already Opened"},0,{"$f":"IF(O106>VLOOKUP(L106,'Drop Down'!$A$3:$B$10,2,0),\"1\",\"0\")","v":"0"},0,{"$f":"SUM(Table1[[#This Row],[Case Aide Hours]],Table1[[#This Row],[Case Aide Travel Time]])","v":0},{"$f":"IFERROR(IF(OR(Table1[[#This Row],[Child Support Level]]=\"Support Services Lvl 1\", Table1[[#This Row],[Child Support Level]]=\"Support Services Lvl 2\",Table1[[#This Row],[Child Support Level]]=\"Select\"),\"Case Aid Not Allowed\", PRODUCT(Table1[[#This Row],[Total Case Aide]],VLOOKUP(Table1[[#This Row],[County Where Youth Resides]],'Drop Down'!K:M,3,0))),\"0\")","v":"Case Aid Not Allowed"},"No",0,0]
["Select","-","-","-","-","DD/MM/YYYY","DD/MM/YYYY","Select","Select",{"$f":"VLOOKUP(Table1[[#This Row],[DCYF Case Region]],'Drop Down'!$F$3:$G$9,2,0)","v":"Select"},"Select","Select","Select",{"$f":"IFERROR(IF(M107=\"No\",INDEX(IndexMatch!C:C,MATCH(1,(IndexMatch!A:A=VLOOKUP(H107,'Drop Down'!K:L,2,0))*(IndexMatch!B:B=L107),0)),\"Service Already Opened\"),\"N/A\")","v":"Service Already Opened"},0,{"$f":"IF(O107>VLOOKUP(L107,'Drop Down'!$A$3:$B$10,2,0),\"1\",\"0\")","v":"0"},0,{"$f":"SUM(Table1[[#This Row],[Case Aide Hours]],Table1[[#This Row],[Case Aide Travel Time]])","v":0},{"$f":"IFERROR(IF(OR(Table1[[#This Row],[Child Support Level]]=\"Support Services Lvl 1\", Table1[[#This Row],[Child Support Level]]=\"Support Services Lvl 2\",Table1[[#This Row],[Child Support Level]]=\"Select\"),\"Case Aid Not Allowed\", PRODUCT(Table1[[#This Row],[Total Case Aide]],VLOOKUP(Table1[[#This Row],[County Where Youth Resides]],'Drop Down'!K:M,3,0))),\"0\")","v":"Case Aid Not Allowed"},"No",0,0]
["Select","-","-","-","-","DD/MM/YYYY","DD/MM/YYYY","Select","Select",{"$f":"VLOOKUP(Table1[[#This Row],[DCYF Case Region]],'Drop Down'!$F$3:$G$9,2,0)","v":"Select"},"Select","Select","Select",{"$f":"IFERROR(IF(M108=\"No\",INDEX(IndexMatch!C:C,MATCH(1,(IndexMatch!A:A=VLOOKUP(H108,'Drop Down'!K:L,2,0))*(IndexMatch!B:B=L108),0)),\"Service Already Opened\"),\"N/A\")","v":"Service Already Opened"},0,{"$f":"IF(O108>VLOOKUP(L108,'Drop Down'!$A$3:$B$10,2,0),\"1\",\"0\")","v":"0"},0,{"$f":"SUM(Table1[[#This Row],[Case Aide Hours]],Table1[[#This Row],[Case Aide Travel Time]])","v":0},{"$f":"IFERROR(IF(OR(Table1[[#This Row],[Child Support Level]]=\"Support Services Lvl 1\", Table1[[#This Row],[Child Support Level]]=\"Support Services Lvl 2\",Table1[[#This Row],[Child Support Level]]=\"Select\"),\"Case Aid Not Allowed\", PRODUCT(Table1[[#This Row],[Total Case Aide]],VLOOKUP(Table1[[#This Row],[County Where Youth Resides]],'Drop Down'!K:M,3,0))),\"0\")","v":"Case Aid Not Allowed"},"No",0,0]
["Select","-","-","-","-","DD/MM/YYYY","DD/MM/YYYY","Select","Select",{"$f":"VLOOKUP(Table1[[#This Row],[DCYF Case Region]],'Drop Down'!$F$3:$G$9,2,0)","v":"Select"},"Select","Select","Select",{"$f":"IFERROR(IF(M109=\"No\",INDEX(IndexMatch!C:C,MATCH(1,(IndexMatch!A:A=VLOOKUP(H109,'Drop Down'!K:L,2,0))*(IndexMatch!B:B=L109),0)),\"Service Already Opened\"),\"N/A\")","v":"Service Already Opened"},0,{"$f":"IF(O109>VLOOKUP(L109,'Drop Down'!$A$3:$B$10,2,0),\"1\",\"0\")","v":"0"},0,{"$f":"SUM(Table1[[#This Row],[Case Aide Hours]],Table1[[#This Row],[Case Aide Travel Time]])","v":0},{"$f":"IFERROR(IF(OR(Table1[[#This Row],[Child Support Level]]=\"Support Services Lvl 1\", Table1[[#This Row],[Child Support Level]]=\"Support Services Lvl 2\",Table1[[#This Row],[Child Support Level]]=\"Select\"),\"Case Aid Not Allowed\", PRODUCT(Table1[[#This Row],[Total Case Aide]],VLOOKUP(Table1[[#This Row],[County Where Youth Resides]],'Drop Down'!K:M,3,0))),\"0\")","v":"Case Aid Not Allowed"},"No",0,0]
["Select","-","-","-","-","DD/MM/YYYY","DD/MM/YYYY","Select","Select",{"$f":"VLOOKUP(Table1[[#This Row],[DCYF Case Region]],'Drop Down'!$F$3:$G$9,2,0)","v":"Select"},"Select","Select","Select",{"$f":"IFERROR(IF(M110=\"No\",INDEX(IndexMatch!C:C,MATCH(1,(IndexMatch!A:A=VLOOKUP(H110,'Drop Down'!K:L,2,0))*(IndexMatch!B:B=L110),0)),\"Service Already Opened\"),\"N/A\")","v":"Service Already Opened"},0,{"$f":"IF(O110>VLOOKUP(L110,'Drop Down'!$A$3:$B$10,2,0),\"1\",\"0\")","v":"0"},0,{"$f":"SUM(Table1[[#This Row],[Case Aide Hours]],Table1[[#This Row],[Case Aide Travel Time]])","v":0},{"$f":"IFERROR(IF(OR(Table1[[#This Row],[Child Support Level]]=\"Support Services Lvl 1\", Table1[[#This Row],[Child Support Level]]=\"Support Services Lvl 2\",Table1[[#This Row],[Child Support Level]]=\"Select\"),\"Case Aid Not Allowed\", PRODUCT(Table1[[#This Row],[Total Case Aide]],VLOOKUP(Table1[[#This Row],[County Where Youth Resides]],'Drop Down'!K:M,3,0))),\"0\")","v":"Case Aid Not Allowed"},"No",0,0]
["Select","-","-","-","-","DD/MM/YYYY","DD/MM/YYYY","Select","Select",{"$f":"VLOOKUP(Table1[[#This Row],[DCYF Case Region]],'Drop Down'!$F$3:$G$9,2,0)","v":"Select"},"Select","Select","Select",{"$f":"IFERROR(IF(M111=\"No\",INDEX(IndexMatch!C:C,MATCH(1,(IndexMatch!A:A=VLOOKUP(H111,'Drop Down'!K:L,2,0))*(IndexMatch!B:B=L111),0)),\"Service Already Opened\"),\"N/A\")","v":"Service Already Opened"},0,{"$f":"IF(O111>VLOOKUP(L111,'Drop Down'!$A$3:$B$10,2,0),\"1\",\"0\")","v":"0"},0,{"$f":"SUM(Table1[[#This Row],[Case Aide Hours]],Table1[[#This Row],[Case Aide Travel Time]])","v":0},{"$f":"IFERROR(IF(OR(Table1[[#This Row],[Child Support Level]]=\"Support Services Lvl 1\", Table1[[#This Row],[Child Support Level]]=\"Support Services Lvl 2\",Table1[[#This Row],[Child Support Level]]=\"Select\"),\"Case Aid Not Allowed\", PRODUCT(Table1[[#This Row],[Total Case Aide]],VLOOKUP(Table1[[#This Row],[County Where Youth Resides]],'Drop Down'!K:M,3,0))),\"0\")","v":"Case Aid Not Allowed"},"No",0,0]
["Select","-","-","-","-","DD/MM/YYYY","DD/MM/YYYY","Select","Select",{"$f":"VLOOKUP(Table1[[#This Row],[DCYF Case Region]],'Drop Down'!$F$3:$G$9,2,0)","v":"Select"},"Select","Select","Select",{"$f":"IFERROR(IF(M112=\"No\",INDEX(IndexMatch!C:C,MATCH(1,(IndexMatch!A:A=VLOOKUP(H112,'Drop Down'!K:L,2,0))*(IndexMatch!B:B=L112),0)),\"Service Already Opened\"),\"N/A\")","v":"Service Already Opened"},0,{"$f":"IF(O112>VLOOKUP(L112,'Drop Down'!$A$3:$B$10,2,0),\"1\",\"0\")","v":"0"},0,{"$f":"SUM(Table1[[#This Row],[Case Aide Hours]],Table1[[#This Row],[Case Aide Travel Time]])","v":0},{"$f":"IFERROR(IF(OR(Table1[[#This Row],[Child Support Level]]=\"Support Services Lvl 1\", Table1[[#This Row],[Child Support Level]]=\"Support Services Lvl 2\",Table1[[#This Row],[Child Support Level]]=\"Select\"),\"Case Aid Not Allowed\", PRODUCT(Table1[[#This Row],[Total Case Aide]],VLOOKUP(Table1[[#This Row],[County Where Youth Resides]],'Drop Down'!K:M,3,0))),\"0\")","v":"Case Aid Not Allowed"},"No",0,0]
["Select","-","-","-","-","DD/MM/YYYY","DD/MM/YYYY","Select","Select",{"$f":"VLOOKUP(Table1[[#This Row],[DCYF Case Region]],'Drop Down'!$F$3:$G$9,2,0)","v":"Select"},"Select","Select","Select",{"$f":"IFERROR(IF(M113=\"No\",INDEX(IndexMatch!C:C,MATCH(1,(IndexMatch!A:A=VLOOKUP(H113,'Drop Down'!K:L,2,0))*(IndexMatch!B:B=L113),0)),\"Service Already Opened\"),\"N/A\")","v":"Service Already Opened"},0,{"$f":"IF(O113>VLOOKUP(L113,'Drop Down'!$A$3:$B$10,2,0),\"1\",\"0\")","v":"0"},0,{"$f":"SUM(Table1[[#This Row],[Case Aide Hours]],Table1[[#This Row],[Case Aide Travel Time]])","v":0},{"$f":"IFERROR(IF(OR(Table1[[#This Row],[Child Support Level]]=\"Support Services Lvl 1\", Table1[[#This Row],[Child Support Level]]=\"Support Services Lvl 2\",Table1[[#This Row],[Child Support Level]]=\"Select\"),\"Case Aid Not Allowed\", PRODUCT(Table1[[#This Row],[Total Case Aide]],VLOOKUP(Table1[[#This Row],[County Where Youth Resides]],'Drop Down'!K:M,3,0))),\"0\")","v":"Case Aid Not Allowed"},"No",0,0]
["Select","-","-","-","-","DD/MM/YYYY","DD/MM/YYYY","Select","Select",{"$f":"VLOOKUP(Table1[[#This Row],[DCYF Case Region]],'Drop Down'!$F$3:$G$9,2,0)","v":"Select"},"Select","Select","Select",{"$f":"IFERROR(IF(M114=\"No\",INDEX(IndexMatch!C:C,MATCH(1,(IndexMatch!A:A=VLOOKUP(H114,'Drop Down'!K:L,2,0))*(IndexMatch!B:B=L114),0)),\"Service Already Opened\"),\"N/A\")","v":"Service Already Opened"},0,{"$f":"IF(O114>VLOOKUP(L114,'Drop Down'!$A$3:$B$10,2,0),\"1\",\"0\")","v":"0"},0,{"$f":"SUM(Table1[[#This Row],[Case Aide Hours]],Table1[[#This Row],[Case Aide Travel Time]])","v":0},{"$f":"IFERROR(IF(OR(Table1[[#This Row],[Child Support Level]]=\"Support Services Lvl 1\", Table1[[#This Row],[Child Support Level]]=\"Support Services Lvl 2\",Table1[[#This Row],[Child Support Level]]=\"Select\"),\"Case Aid Not Allowed\", PRODUCT(Table1[[#This Row],[Total Case Aide]],VLOOKUP(Table1[[#This Row],[County Where Youth Resides]],'Drop Down'!K:M,3,0))),\"0\")","v":"Case Aid Not Allowed"},"No",0,0]
["Select","-","-","-","-","DD/MM/YYYY","DD/MM/YYYY","Select","Select",{"$f":"VLOOKUP(Table1[[#This Row],[DCYF Case Region]],'Drop Down'!$F$3:$G$9,2,0)","v":"Select"},"Select","Select","Select",{"$f":"IFERROR(IF(M115=\"No\",INDEX(IndexMatch!C:C,MATCH(1,(IndexMatch!A:A=VLOOKUP(H115,'Drop Down'!K:L,2,0))*(IndexMatch!B:B=L115),0)),\"Service Already Opened\"),\"N/A\")","v":"Service Already Opened"},0,{"$f":"IF(O115>VLOOKUP(L115,'Drop Down'!$A$3:$B$10,2,0),\"1\",\"0\")","v":"0"},0,{"$f":"SUM(Table1[[#This Row],[Case Aide Hours]],Table1[[#This Row],[Case Aide Travel Time]])","v":0},{"$f":"IFERROR(IF(OR(Table1[[#This Row],[Child Support Level]]=\"Support Services Lvl 1\", Table1[[#This Row],[Child Support Level]]=\"Support Services Lvl 2\",Table1[[#This Row],[Child Support Level]]=\"Select\"),\"Case Aid Not Allowed\", PRODUCT(Table1[[#This Row],[Total Case Aide]],VLOOKUP(Table1[[#This Row],[County Where Youth Resides]],'Drop Down'!K:M,3,0))),\"0\")","v":"Case Aid Not Allowed"},"No",0,0]
["Select","-","-","-","-","DD/MM/YYYY","DD/MM/YYYY","Select","Select",{"$f":"VLOOKUP(Table1[[#This Row],[DCYF Case Region]],'Drop Down'!$F$3:$G$9,2,0)","v":"Select"},"Select","Select","Select",{"$f":"IFERROR(IF(M116=\"No\",INDEX(IndexMatch!C:C,MATCH(1,(IndexMatch!A:A=VLOOKUP(H116,'Drop Down'!K:L,2,0))*(IndexMatch!B:B=L116),0)),\"Service Already Opened\"),\"N/A\")","v":"Service Already Opened"},0,{"$f":"IF(O116>VLOOKUP(L116,'Drop Down'!$A$3:$B$10,2,0),\"1\",\"0\")","v":"0"},0,{"$f":"SUM(Table1[[#This Row],[Case Aide Hours]],Table1[[#This Row],[Case Aide Travel Time]])","v":0},{"$f":"IFERROR(IF(OR(Table1[[#This Row],[Child Support Level]]=\"Support Services Lvl 1\", Table1[[#This Row],[Child Support Level]]=\"Support Services Lvl 2\",Table1[[#This Row],[Child Support Level]]=\"Select\"),\"Case Aid Not Allowed\", PRODUCT(Table1[[#This Row],[Total Case Aide]],VLOOKUP(Table1[[#This Row],[County Where Youth Resides]],'Drop Down'!K:M,3,0))),\"0\")","v":"Case Aid Not Allowed"},"No",0,0]
["Select","-","-","-","-","DD/MM/YYYY","DD/MM/YYYY","Select","Select",{"$f":"VLOOKUP(Table1[[#This Row],[DCYF Case Region]],'Drop Down'!$F$3:$G$9,2,0)","v":"Select"},"Select","Select","Select",{"$f":"IFERROR(IF(M117=\"No\",INDEX(IndexMatch!C:C,MATCH(1,(IndexMatch!A:A=VLOOKUP(H117,'Drop Down'!K:L,2,0))*(IndexMatch!B:B=L117),0)),\"Service Already Opened\"),\"N/A\")","v":"Service Already Opened"},0,{"$f":"IF(O117>VLOOKUP(L117,'Drop Down'!$A$3:$B$10,2,0),\"1\",\"0\")","v":"0"},0,{"$f":"SUM(Table1[[#This Row],[Case Aide Hours]],Table1[[#This Row],[Case Aide Travel Time]])","v":0},{"$f":"IFERROR(IF(OR(Table1[[#This Row],[Child Support Level]]=\"Support Services Lvl 1\", Table1[[#This Row],[Child Support Level]]=\"Support Services Lvl 2\",Table1[[#This Row],[Child Support Level]]=\"Select\"),\"Case Aid Not Allowed\", PRODUCT(Table1[[#This Row],[Total Case Aide]],VLOOKUP(Table1[[#This Row],[County Where Youth Resides]],'Drop Down'!K:M,3,0))),\"0\")","v":"Case Aid Not Allowed"},"No",0,0]
["Select","-","-","-","-","DD/MM/YYYY","DD/MM/YYYY","Select","Select",{"$f":"VLOOKUP(Table1[[#This Row],[DCYF Case Region]],'Drop Down'!$F$3:$G$9,2,0)","v":"Select"},"Select","Select","Select",{"$f":"IFERROR(IF(M118=\"No\",INDEX(IndexMatch!C:C,MATCH(1,(IndexMatch!A:A=VLOOKUP(H118,'Drop Down'!K:L,2,0))*(IndexMatch!B:B=L118),0)),\"Service Already Opened\"),\"N/A\")","v":"Service Already Opened"},0,{"$f":"IF(O118>VLOOKUP(L118,'Drop Down'!$A$3:$B$10,2,0),\"1\",\"0\")","v":"0"},0,{"$f":"SUM(Table1[[#This Row],[Case Aide Hours]],Table1[[#This Row],[Case Aide Travel Time]])","v":0},{"$f":"IFERROR(IF(OR(Table1[[#This Row],[Child Support Level]]=\"Support Services Lvl 1\", Table1[[#This Row],[Child Support Level]]=\"Support Services Lvl 2\",Table1[[#This Row],[Child Support Level]]=\"Select\"),\"Case Aid Not Allowed\", PRODUCT(Table1[[#This Row],[Total Case Aide]],VLOOKUP(Table1[[#This Row],[County Where Youth Resides]],'Drop Down'!K:M,3,0))),\"0\")","v":"Case Aid Not Allowed"},"No",0,0]
["Select","-","-","-","-","DD/MM/YYYY","DD/MM/YYYY","Select","Select",{"$f":"VLOOKUP(Table1[[#This Row],[DCYF Case Region]],'Drop Down'!$F$3:$G$9,2,0)","v":"Select"},"Select","Select","Select",{"$f":"IFERROR(IF(M119=\"No\",INDEX(IndexMatch!C:C,MATCH(1,(IndexMatch!A:A=VLOOKUP(H119,'Drop Down'!K:L,2,0))*(IndexMatch!B:B=L119),0)),\"Service Already Opened\"),\"N/A\")","v":"Service Already Opened"},0,{"$f":"IF(O119>VLOOKUP(L119,'Drop Down'!$A$3:$B$10,2,0),\"1\",\"0\")","v":"0"},0,{"$f":"SUM(Table1[[#This Row],[Case Aide Hours]],Table1[[#This Row],[Case Aide Travel Time]])","v":0},{"$f":"IFERROR(IF(OR(Table1[[#This Row],[Child Support Level]]=\"Support Services Lvl 1\", Table1[[#This Row],[Child Support Level]]=\"Support Services Lvl 2\",Table1[[#This Row],[Child Support Level]]=\"Select\"),\"Case Aid Not Allowed\", PRODUCT(Table1[[#This Row],[Total Case Aide]],VLOOKUP(Table1[[#This Row],[County Where Youth Resides]],'Drop Down'!K:M,3,0))),\"0\")","v":"Case Aid Not Allowed"},"No",0,0]
["Select","-","-","-","-","DD/MM/YYYY","DD/MM/YYYY","Select","Select",{"$f":"VLOOKUP(Table1[[#This Row],[DCYF Case Region]],'Drop Down'!$F$3:$G$9,2,0)","v":"Select"},"Select","Select","Select",{"$f":"IFERROR(IF(M120=\"No\",INDEX(IndexMatch!C:C,MATCH(1,(IndexMatch!A:A=VLOOKUP(H120,'Drop Down'!K:L,2,0))*(IndexMatch!B:B=L120),0)),\"Service Already Opened\"),\"N/A\")","v":"Service Already Opened"},0,{"$f":"IF(O120>VLOOKUP(L120,'Drop Down'!$A$3:$B$10,2,0),\"1\",\"0\")","v":"0"},0,{"$f":"SUM(Table1[[#This Row],[Case Aide Hours]],Table1[[#This Row],[Case Aide Travel Time]])","v":0},{"$f":"IFERROR(IF(OR(Table1[[#This Row],[Child Support Level]]=\"Support Services Lvl 1\", Table1[[#This Row],[Child Support Level]]=\"Support Services Lvl 2\",Table1[[#This Row],[Child Support Level]]=\"Select\"),\"Case Aid Not Allowed\", PRODUCT(Table1[[#This Row],[Total Case Aide]],VLOOKUP(Table1[[#This Row],[County Where Youth Resides]],'Drop Down'!K:M,3,0))),\"0\")","v":"Case Aid Not Allowed"},"No",0,0]
["Select","-","-","-","-","DD/MM/YYYY","DD/MM/YYYY","Select","Select",{"$f":"VLOOKUP(Table1[[#This Row],[DCYF Case Region]],'Drop Down'!$F$3:$G$9,2,0)","v":"Select"},"Select","Select","Select",{"$f":"IFERROR(IF(M121=\"No\",INDEX(IndexMatch!C:C,MATCH(1,(IndexMatch!A:A=VLOOKUP(H121,'Drop Down'!K:L,2,0))*(IndexMatch!B:B=L121),0)),\"Service Already Opened\"),\"N/A\")","v":"Service Already Opened"},0,{"$f":"IF(O121>VLOOKUP(L121,'Drop Down'!$A$3:$B$10,2,0),\"1\",\"0\")","v":"0"},0,{"$f":"SUM(Table1[[#This Row],[Case Aide Hours]],Table1[[#This Row],[Case Aide Travel Time]])","v":0},{"$f":"IFERROR(IF(OR(Table1[[#This Row],[Child Support Level]]=\"Support Services Lvl 1\", Table1[[#This Row],[Child Support Level]]=\"Support Services Lvl 2\",Table1[[#This Row],[Child Support Level]]=\"Select\"),\"Case Aid Not Allowed\", PRODUCT(Table1[[#This Row],[Total Case Aide]],VLOOKUP(Table1[[#This Row],[County Where Youth Resides]],'Drop Down'!K:M,3,0))),\"0\")","v":"Case Aid Not Allowed"},"No",0,0]
["Select","-","-","-","-","DD/MM/YYYY","DD/MM/YYYY","Select","Select",{"$f":"VLOOKUP(Table1[[#This Row],[DCYF Case Region]],'Drop Down'!$F$3:$G$9,2,0)","v":"Select"},"Select","Select","Select",{"$f":"IFERROR(IF(M122=\"No\",INDEX(IndexMatch!C:C,MATCH(1,(IndexMatch!A:A=VLOOKUP(H122,'Drop Down'!K:L,2,0))*(IndexMatch!B:B=L122),0)),\"Service Already Opened\"),\"N/A\")","v":"Service Already Opened"},0,{"$f":"IF(O122>VLOOKUP(L122,'Drop Down'!$A$3:$B$10,2,0),\"1\",\"0\")","v":"0"},0,{"$f":"SUM(Table1[[#This Row],[Case Aide Hours]],Table1[[#This Row],[Case Aide Travel Time]])","v":0},{"$f":"IFERROR(IF(OR(Table1[[#This Row],[Child Support Level]]=\"Support Services Lvl 1\", Table1[[#This Row],[Child Support Level]]=\"Support Services Lvl 2\",Table1[[#This Row],[Child Support Level]]=\"Select\"),\"Case Aid Not Allowed\", PRODUCT(Table1[[#This Row],[Total Case Aide]],VLOOKUP(Table1[[#This Row],[County Where Youth Resides]],'Drop Down'!K:M,3,0))),\"0\")","v":"Case Aid Not Allowed"},"No",0,0]
["Select","-","-","-","-","DD/MM/YYYY","DD/MM/YYYY","Select","Select",{"$f":"VLOOKUP(Table1[[#This Row],[DCYF Case Region]],'Drop Down'!$F$3:$G$9,2,0)","v":"Select"},"Select","Select","Select",{"$f":"IFERROR(IF(M123=\"No\",INDEX(IndexMatch!C:C,MATCH(1,(IndexMatch!A:A=VLOOKUP(H123,'Drop Down'!K:L,2,0))*(IndexMatch!B:B=L123),0)),\"Service Already Opened\"),\"N/A\")","v":"Service Already Opened"},0,{"$f":"IF(O123>VLOOKUP(L123,'Drop Down'!$A$3:$B$10,2,0),\"1\",\"0\")","v":"0"},0,{"$f":"SUM(Table1[[#This Row],[Case Aide Hours]],Table1[[#This Row],[Case Aide Travel Time]])","v":0},{"$f":"IFERROR(IF(OR(Table1[[#This Row],[Child Support Level]]=\"Support Services Lvl 1\", Table1[[#This Row],[Child Support Level]]=\"Support Services Lvl 2\",Table1[[#This Row],[Child Support Level]]=\"Select\"),\"Case Aid Not Allowed\", PRODUCT(Table1[[#This Row],[Total Case Aide]],VLOOKUP(Table1[[#This Row],[County Where Youth Resides]],'Drop Down'!K:M,3,0))),\"0\")","v":"Case Aid Not Allowed"},"No",0,0]
["Select","-","-","-","-","DD/MM/YYYY","DD/MM/YYYY","Select","Select",{"$f":"VLOOKUP(Table1[[#This Row],[DCYF Case Region]],'Drop Down'!$F$3:$G$9,2,0)","v":"Select"},"Select","Select","Select",{"$f":"IFERROR(IF(M124=\"No\",INDEX(IndexMatch!C:C,MATCH(1,(IndexMatch!A:A=VLOOKUP(H124,'Drop Down'!K:L,2,0))*(IndexMatch!B:B=L124),0)),\"Service Already Opened\"),\"N/A\")","v":"Service Already Opened"},0,{"$f":"IF(O124>VLOOKUP(L124,'Drop Down'!$A$3:$B$10,2,0),\"1\",\"0\")","v":"0"},0,{"$f":"SUM(Table1[[#This Row],[Case Aide Hours]],Table1[[#This Row],[Case Aide Travel Time]])","v":0},{"$f":"IFERROR(IF(OR(Table1[[#This Row],[Child Support Level]]=\"Support Services Lvl 1\", Table1[[#This Row],[Child Support Level]]=\"Support Services Lvl 2\",Table1[[#This Row],[Child Support Level]]=\"Select\"),\"Case Aid Not Allowed\", PRODUCT(Table1[[#This Row],[Total Case Aide]],VLOOKUP(Table1[[#This Row],[County Where Youth Resides]],'Drop Down'!K:M,3,0))),\"0\")","v":"Case Aid Not Allowed"},"No",0,0]
["Select","-","-","-","-","DD/MM/YYYY","DD/MM/YYYY","Select","Select",{"$f":"VLOOKUP(Table1[[#This Row],[DCYF Case Region]],'Drop Down'!$F$3:$G$9,2,0)","v":"Select"},"Select","Select","Select",{"$f":"IFERROR(IF(M125=\"No\",INDEX(IndexMatch!C:C,MATCH(1,(IndexMatch!A:A=VLOOKUP(H125,'Drop Down'!K:L,2,0))*(IndexMatch!B:B=L125),0)),\"Service Already Opened\"),\"N/A\")","v":"Service Already Opened"},0,{"$f":"IF(O125>VLOOKUP(L125,'Drop Down'!$A$3:$B$10,2,0),\"1\",\"0\")","v":"0"},0,{"$f":"SUM(Table1[[#This Row],[Case Aide Hours]],Table1[[#This Row],[Case Aide Travel Time]])","v":0},{"$f":"IFERROR(IF(OR(Table1[[#This Row],[Child Support Level]]=\"Support Services Lvl 1\", Table1[[#This Row],[Child Support Level]]=\"Support Services Lvl 2\",Table1[[#This Row],[Child Support Level]]=\"Select\"),\"Case Aid Not Allowed\", PRODUCT(Table1[[#This Row],[Total Case Aide]],VLOOKUP(Table1[[#This Row],[County Where Youth Resides]],'Drop Down'!K:M,3,0))),\"0\")","v":"Case Aid Not Allowed"},"No",0,0]
["Select","-","-","-","-","DD/MM/YYYY","DD/MM/YYYY","Select","Select",{"$f":"VLOOKUP(Table1[[#This Row],[DCYF Case Region]],'Drop Down'!$F$3:$G$9,2,0)","v":"Select"},"Select","Select","Select",{"$f":"IFERROR(IF(M126=\"No\",INDEX(IndexMatch!C:C,MATCH(1,(IndexMatch!A:A=VLOOKUP(H126,'Drop Down'!K:L,2,0))*(IndexMatch!B:B=L126),0)),\"Service Already Opened\"),\"N/A\")","v":"Service Already Opened"},0,{"$f":"IF(O126>VLOOKUP(L126,'Drop Down'!$A$3:$B$10,2,0),\"1\",\"0\")","v":"0"},0,{"$f":"SUM(Table1[[#This Row],[Case Aide Hours]],Table1[[#This Row],[Case Aide Travel Time]])","v":0},{"$f":"IFERROR(IF(OR(Table1[[#This Row],[Child Support Level]]=\"Support Services Lvl 1\", Table1[[#This Row],[Child Support Level]]=\"Support Services Lvl 2\",Table1[[#This Row],[Child Support Level]]=\"Select\"),\"Case Aid Not Allowed\", PRODUCT(Table1[[#This Row],[Total Case Aide]],VLOOKUP(Table1[[#This Row],[County Where Youth Resides]],'Drop Down'!K:M,3,0))),\"0\")","v":"Case Aid Not Allowed"},"No",0,0]
["Select","-","-","-","-","DD/MM/YYYY","DD/MM/YYYY","Select","Select",{"$f":"VLOOKUP(Table1[[#This Row],[DCYF Case Region]],'Drop Down'!$F$3:$G$9,2,0)","v":"Select"},"Select","Select","Select",{"$f":"IFERROR(IF(M127=\"No\",INDEX(IndexMatch!C:C,MATCH(1,(IndexMatch!A:A=VLOOKUP(H127,'Drop Down'!K:L,2,0))*(IndexMatch!B:B=L127),0)),\"Service Already Opened\"),\"N/A\")","v":"Service Already Opened"},0,{"$f":"IF(O127>VLOOKUP(L127,'Drop Down'!$A$3:$B$10,2,0),\"1\",\"0\")","v":"0"},0,{"$f":"SUM(Table1[[#This Row],[Case Aide Hours]],Table1[[#This Row],[Case Aide Travel Time]])","v":0},{"$f":"IFERROR(IF(OR(Table1[[#This Row],[Child Support Level]]=\"Support Services Lvl 1\", Table1[[#This Row],[Child Support Level]]=\"Support Services Lvl 2\",Table1[[#This Row],[Child Support Level]]=\"Select\"),\"Case Aid Not Allowed\", PRODUCT(Table1[[#This Row],[Total Case Aide]],VLOOKUP(Table1[[#This Row],[County Where Youth Resides]],'Drop Down'!K:M,3,0))),\"0\")","v":"Case Aid Not Allowed"},"No",0,0]
["Select","-","-","-","-","DD/MM/YYYY","DD/MM/YYYY","Select","Select",{"$f":"VLOOKUP(Table1[[#This Row],[DCYF Case Region]],'Drop Down'!$F$3:$G$9,2,0)","v":"Select"},"Select","Select","Select",{"$f":"IFERROR(IF(M128=\"No\",INDEX(IndexMatch!C:C,MATCH(1,(IndexMatch!A:A=VLOOKUP(H128,'Drop Down'!K:L,2,0))*(IndexMatch!B:B=L128),0)),\"Service Already Opened\"),\"N/A\")","v":"Service Already Opened"},0,{"$f":"IF(O128>VLOOKUP(L128,'Drop Down'!$A$3:$B$10,2,0),\"1\",\"0\")","v":"0"},0,{"$f":"SUM(Table1[[#This Row],[Case Aide Hours]],Table1[[#This Row],[Case Aide Travel Time]])","v":0},{"$f":"IFERROR(IF(OR(Table1[[#This Row],[Child Support Level]]=\"Support Services Lvl 1\", Table1[[#This Row],[Child Support Level]]=\"Support Services Lvl 2\",Table1[[#This Row],[Child Support Level]]=\"Select\"),\"Case Aid Not Allowed\", PRODUCT(Table1[[#This Row],[Total Case Aide]],VLOOKUP(Table1[[#This Row],[County Where Youth Resides]],'Drop Down'!K:M,3,0))),\"0\")","v":"Case Aid Not Allowed"},"No",0,0]
["Select","-","-","-","-","DD/MM/YYYY","DD/MM/YYYY","Select","Select",{"$f":"VLOOKUP(Table1[[#This Row],[DCYF Case Region]],'Drop Down'!$F$3:$G$9,2,0)","v":"Select"},"Select","Select","Select",{"$f":"IFERROR(IF(M129=\"No\",INDEX(IndexMatch!C:C,MATCH(1,(IndexMatch!A:A=VLOOKUP(H129,'Drop Down'!K:L,2,0))*(IndexMatch!B:B=L129),0)),\"Service Already Opened\"),\"N/A\")","v":"Service Already Opened"},0,{"$f":"IF(O129>VLOOKUP(L129,'Drop Down'!$A$3:$B$10,2,0),\"1\",\"0\")","v":"0"},0,{"$f":"SUM(Table1[[#This Row],[Case Aide Hours]],Table1[[#This Row],[Case Aide Travel Time]])","v":0},{"$f":"IFERROR(IF(OR(Table1[[#This Row],[Child Support Level]]=\"Support Services Lvl 1\", Table1[[#This Row],[Child Support Level]]=\"Support Services Lvl 2\",Table1[[#This Row],[Child Support Level]]=\"Select\"),\"Case Aid Not Allowed\", PRODUCT(Table1[[#This Row],[Total Case Aide]],VLOOKUP(Table1[[#This Row],[County Where Youth Resides]],'Drop Down'!K:M,3,0))),\"0\")","v":"Case Aid Not Allowed"},"No",0,0]
["Select","-","-","-","-","DD/MM/YYYY","DD/MM/YYYY","Select","Select",{"$f":"VLOOKUP(Table1[[#This Row],[DCYF Case Region]],'Drop Down'!$F$3:$G$9,2,0)","v":"Select"},"Select","Select","Select",{"$f":"IFERROR(IF(M130=\"No\",INDEX(IndexMatch!C:C,MATCH(1,(IndexMatch!A:A=VLOOKUP(H130,'Drop Down'!K:L,2,0))*(IndexMatch!B:B=L130),0)),\"Service Already Opened\"),\"N/A\")","v":"Service Already Opened"},0,{"$f":"IF(O130>VLOOKUP(L130,'Drop Down'!$A$3:$B$10,2,0),\"1\",\"0\")","v":"0"},0,{"$f":"SUM(Table1[[#This Row],[Case Aide Hours]],Table1[[#This Row],[Case Aide Travel Time]])","v":0},{"$f":"IFERROR(IF(OR(Table1[[#This Row],[Child Support Level]]=\"Support Services Lvl 1\", Table1[[#This Row],[Child Support Level]]=\"Support Services Lvl 2\",Table1[[#This Row],[Child Support Level]]=\"Select\"),\"Case Aid Not Allowed\", PRODUCT(Table1[[#This Row],[Total Case Aide]],VLOOKUP(Table1[[#This Row],[County Where Youth Resides]],'Drop Down'!K:M,3,0))),\"0\")","v":"Case Aid Not Allowed"},"No",0,{"$f":"ROUND(PRODUCT(U130,0.67),2)","v":0}]
["Select","-","-","-","-","DD/MM/YYYY","DD/MM/YYYY","Select","Select",{"$f":"VLOOKUP(Table1[[#This Row],[DCYF Case Region]],'Drop Down'!$F$3:$G$9,2,0)","v":"Select"},"Select","Select","Select",{"$f":"IFERROR(IF(M131=\"No\",INDEX(IndexMatch!C:C,MATCH(1,(IndexMatch!A:A=VLOOKUP(H131,'Drop Down'!K:L,2,0))*(IndexMatch!B:B=L131),0)),\"Service Already Opened\"),\"N/A\")","v":"Service Already Opened"},0,{"$f":"IF(O131>VLOOKUP(L131,'Drop Down'!$A$3:$B$10,2,0),\"1\",\"0\")","v":"0"},0,{"$f":"SUM(Table1[[#This Row],[Case Aide Hours]],Table1[[#This Row],[Case Aide Travel Time]])","v":0},{"$f":"IFERROR(IF(OR(Table1[[#This Row],[Child Support Level]]=\"Support Services Lvl 1\", Table1[[#This Row],[Child Support Level]]=\"Support Services Lvl 2\",Table1[[#This Row],[Child Support Level]]=\"Select\"),\"Case Aid Not Allowed\", PRODUCT(Table1[[#This Row],[Total Case Aide]],VLOOKUP(Table1[[#This Row],[County Where Youth Resides]],'Drop Down'!K:M,3,0))),\"0\")","v":"Case Aid Not Allowed"},{"$f":"IF(P131=\"1\",\"Yes\",\"No\")","v":"No"},0,0]
["Select","-","-","-","-","DD/MM/YYYY","DD/MM/YYYY","Select","Select",{"$f":"VLOOKUP(Table1[[#This Row],[DCYF Case Region]],'Drop Down'!$F$3:$G$9,2,0)","v":"Select"},"Select","Select","Select",{"$f":"IFERROR(IF(M132=\"No\",INDEX(IndexMatch!C:C,MATCH(1,(IndexMatch!A:A=VLOOKUP(H132,'Drop Down'!K:L,2,0))*(IndexMatch!B:B=L132),0)),\"Service Already Opened\"),\"N/A\")","v":"Service Already Opened"},0,{"$f":"IF(O132>VLOOKUP(L132,'Drop Down'!$A$3:$B$10,2,0),\"1\",\"0\")","v":"0"},0,{"$f":"SUM(Table1[[#This Row],[Case Aide Hours]],Table1[[#This Row],[Case Aide Travel Time]])","v":0},{"$f":"IFERROR(IF(OR(Table1[[#This Row],[Child Support Level]]=\"Support Services Lvl 1\", Table1[[#This Row],[Child Support Level]]=\"Support Services Lvl 2\",Table1[[#This Row],[Child Support Level]]=\"Select\"),\"Case Aid Not Allowed\", PRODUCT(Table1[[#This Row],[Total Case Aide]],VLOOKUP(Table1[[#This Row],[County Where Youth Resides]],'Drop Down'!K:M,3,0))),\"0\")","v":"Case Aid Not Allowed"},"No",0,0]
["Select","-","-","-","-","DD/MM/YYYY","DD/MM/YYYY","Select","Select",{"$f":"VLOOKUP(Table1[[#This Row],[DCYF Case Region]],'Drop Down'!$F$3:$G$9,2,0)","v":"Select"},"Select","Select","Select",{"$f":"IFERROR(IF(M133=\"No\",INDEX(IndexMatch!C:C,MATCH(1,(IndexMatch!A:A=VLOOKUP(H133,'Drop Down'!K:L,2,0))*(IndexMatch!B:B=L133),0)),\"Service Already Opened\"),\"N/A\")","v":"Service Already Opened"},0,{"$f":"IF(O133>VLOOKUP(L133,'Drop Down'!$A$3:$B$10,2,0),\"1\",\"0\")","v":"0"},0,{"$f":"SUM(Table1[[#This Row],[Case Aide Hours]],Table1[[#This Row],[Case Aide Travel Time]])","v":0},{"$f":"IFERROR(IF(OR(Table1[[#This Row],[Child Support Level]]=\"Support Services Lvl 1\", Table1[[#This Row],[Child Support Level]]=\"Support Services Lvl 2\",Table1[[#This Row],[Child Support Level]]=\"Select\"),\"Case Aid Not Allowed\", PRODUCT(Table1[[#This Row],[Total Case Aide]],VLOOKUP(Table1[[#This Row],[County Where Youth Resides]],'Drop Down'!K:M,3,0))),\"0\")","v":"Case Aid Not Allowed"},"No",0,0]
["Select","-","-","-","-","DD/MM/YYYY","DD/MM/YYYY","Select","Select",{"$f":"VLOOKUP(Table1[[#This Row],[DCYF Case Region]],'Drop Down'!$F$3:$G$9,2,0)","v":"Select"},"Select","Select","Select",{"$f":"IFERROR(IF(M134=\"No\",INDEX(IndexMatch!C:C,MATCH(1,(IndexMatch!A:A=VLOOKUP(H134,'Drop Down'!K:L,2,0))*(IndexMatch!B:B=L134),0)),\"Service Already Opened\"),\"N/A\")","v":"Service Already Opened"},0,{"$f":"IF(O134>VLOOKUP(L134,'Drop Down'!$A$3:$B$10,2,0),\"1\",\"0\")","v":"0"},0,{"$f":"SUM(Table1[[#This Row],[Case Aide Hours]],Table1[[#This Row],[Case Aide Travel Time]])","v":0},{"$f":"IFERROR(IF(OR(Table1[[#This Row],[Child Support Level]]=\"Support Services Lvl 1\", Table1[[#This Row],[Child Support Level]]=\"Support Services Lvl 2\",Table1[[#This Row],[Child Support Level]]=\"Select\"),\"Case Aid Not Allowed\", PRODUCT(Table1[[#This Row],[Total Case Aide]],VLOOKUP(Table1[[#This Row],[County Where Youth Resides]],'Drop Down'!K:M,3,0))),\"0\")","v":"Case Aid Not Allowed"},"No",0,0]
["Select","-","-","-","-","DD/MM/YYYY","DD/MM/YYYY","Select","Select",{"$f":"VLOOKUP(Table1[[#This Row],[DCYF Case Region]],'Drop Down'!$F$3:$G$9,2,0)","v":"Select"},"Select","Select","Select",{"$f":"IFERROR(IF(M135=\"No\",INDEX(IndexMatch!C:C,MATCH(1,(IndexMatch!A:A=VLOOKUP(H135,'Drop Down'!K:L,2,0))*(IndexMatch!B:B=L135),0)),\"Service Already Opened\"),\"N/A\")","v":"Service Already Opened"},0,{"$f":"IF(O135>VLOOKUP(L135,'Drop Down'!$A$3:$B$10,2,0),\"1\",\"0\")","v":"0"},0,{"$f":"SUM(Table1[[#This Row],[Case Aide Hours]],Table1[[#This Row],[Case Aide Travel Time]])","v":0},{"$f":"IFERROR(IF(OR(Table1[[#This Row],[Child Support Level]]=\"Support Services Lvl 1\", Table1[[#This Row],[Child Support Level]]=\"Support Services Lvl 2\",Table1[[#This Row],[Child Support Level]]=\"Select\"),\"Case Aid Not Allowed\", PRODUCT(Table1[[#This Row],[Total Case Aide]],VLOOKUP(Table1[[#This Row],[County Where Youth Resides]],'Drop Down'!K:M,3,0))),\"0\")","v":"Case Aid Not Allowed"},"No",0,0]
["Select","-","-","-","-","DD/MM/YYYY","DD/MM/YYYY","Select","Select",{"$f":"VLOOKUP(Table1[[#This Row],[DCYF Case Region]],'Drop Down'!$F$3:$G$9,2,0)","v":"Select"},"Select","Select","Select",{"$f":"IFERROR(IF(M136=\"No\",INDEX(IndexMatch!C:C,MATCH(1,(IndexMatch!A:A=VLOOKUP(H136,'Drop Down'!K:L,2,0))*(IndexMatch!B:B=L136),0)),\"Service Already Opened\"),\"N/A\")","v":"Service Already Opened"},0,{"$f":"IF(O136>VLOOKUP(L136,'Drop Down'!$A$3:$B$10,2,0),\"1\",\"0\")","v":"0"},0,{"$f":"SUM(Table1[[#This Row],[Case Aide Hours]],Table1[[#This Row],[Case Aide Travel Time]])","v":0},{"$f":"IFERROR(IF(OR(Table1[[#This Row],[Child Support Level]]=\"Support Services Lvl 1\", Table1[[#This Row],[Child Support Level]]=\"Support Services Lvl 2\",Table1[[#This Row],[Child Support Level]]=\"Select\"),\"Case Aid Not Allowed\", PRODUCT(Table1[[#This Row],[Total Case Aide]],VLOOKUP(Table1[[#This Row],[County Where Youth Resides]],'Drop Down'!K:M,3,0))),\"0\")","v":"Case Aid Not Allowed"},"No",0,0]
["Select","-","-","-","-","DD/MM/YYYY","DD/MM/YYYY","Select","Select",{"$f":"VLOOKUP(Table1[[#This Row],[DCYF Case Region]],'Drop Down'!$F$3:$G$9,2,0)","v":"Select"},"Select","Select","Select",{"$f":"IFERROR(IF(M137=\"No\",INDEX(IndexMatch!C:C,MATCH(1,(IndexMatch!A:A=VLOOKUP(H137,'Drop Down'!K:L,2,0))*(IndexMatch!B:B=L137),0)),\"Service Already Opened\"),\"N/A\")","v":"Service Already Opened"},0,{"$f":"IF(O137>VLOOKUP(L137,'Drop Down'!$A$3:$B$10,2,0),\"1\",\"0\")","v":"0"},0,{"$f":"SUM(Table1[[#This Row],[Case Aide Hours]],Table1[[#This Row],[Case Aide Travel Time]])","v":0},{"$f":"IFERROR(IF(OR(Table1[[#This Row],[Child Support Level]]=\"Support Services Lvl 1\", Table1[[#This Row],[Child Support Level]]=\"Support Services Lvl 2\",Table1[[#This Row],[Child Support Level]]=\"Select\"),\"Case Aid Not Allowed\", PRODUCT(Table1[[#This Row],[Total Case Aide]],VLOOKUP(Table1[[#This Row],[County Where Youth Resides]],'Drop Down'!K:M,3,0))),\"0\")","v":"Case Aid Not Allowed"},"No",0,0]
["Select","-","-","-","-","DD/MM/YYYY","DD/MM/YYYY","Select","Select",{"$f":"VLOOKUP(Table1[[#This Row],[DCYF Case Region]],'Drop Down'!$F$3:$G$9,2,0)","v":"Select"},"Select","Select","Select",{"$f":"IFERROR(IF(M138=\"No\",INDEX(IndexMatch!C:C,MATCH(1,(IndexMatch!A:A=VLOOKUP(H138,'Drop Down'!K:L,2,0))*(IndexMatch!B:B=L138),0)),\"Service Already Opened\"),\"N/A\")","v":"Service Already Opened"},0,{"$f":"IF(O138>VLOOKUP(L138,'Drop Down'!$A$3:$B$10,2,0),\"1\",\"0\")","v":"0"},0,{"$f":"SUM(Table1[[#This Row],[Case Aide Hours]],Table1[[#This Row],[Case Aide Travel Time]])","v":0},{"$f":"IFERROR(IF(OR(Table1[[#This Row],[Child Support Level]]=\"Support Services Lvl 1\", Table1[[#This Row],[Child Support Level]]=\"Support Services Lvl 2\",Table1[[#This Row],[Child Support Level]]=\"Select\"),\"Case Aid Not Allowed\", PRODUCT(Table1[[#This Row],[Total Case Aide]],VLOOKUP(Table1[[#This Row],[County Where Youth Resides]],'Drop Down'!K:M,3,0))),\"0\")","v":"Case Aid Not Allowed"},"No",0,0]
["Select","-","-","-","-","DD/MM/YYYY","DD/MM/YYYY","Select","Select",{"$f":"VLOOKUP(Table1[[#This Row],[DCYF Case Region]],'Drop Down'!$F$3:$G$9,2,0)","v":"Select"},"Select","Select","Select",{"$f":"IFERROR(IF(M139=\"No\",INDEX(IndexMatch!C:C,MATCH(1,(IndexMatch!A:A=VLOOKUP(H139,'Drop Down'!K:L,2,0))*(IndexMatch!B:B=L139),0)),\"Service Already Opened\"),\"N/A\")","v":"Service Already Opened"},0,{"$f":"IF(O139>VLOOKUP(L139,'Drop Down'!$A$3:$B$10,2,0),\"1\",\"0\")","v":"0"},0,{"$f":"SUM(Table1[[#This Row],[Case Aide Hours]],Table1[[#This Row],[Case Aide Travel Time]])","v":0},{"$f":"IFERROR(IF(OR(Table1[[#This Row],[Child Support Level]]=\"Support Services Lvl 1\", Table1[[#This Row],[Child Support Level]]=\"Support Services Lvl 2\",Table1[[#This Row],[Child Support Level]]=\"Select\"),\"Case Aid Not Allowed\", PRODUCT(Table1[[#This Row],[Total Case Aide]],VLOOKUP(Table1[[#This Row],[County Where Youth Resides]],'Drop Down'!K:M,3,0))),\"0\")","v":"Case Aid Not Allowed"},"No",0,0]
["Select","-","-","-","-","DD/MM/YYYY","DD/MM/YYYY","Select","Select",{"$f":"VLOOKUP(Table1[[#This Row],[DCYF Case Region]],'Drop Down'!$F$3:$G$9,2,0)","v":"Select"},"Select","Select","Select",{"$f":"IFERROR(IF(M140=\"No\",INDEX(IndexMatch!C:C,MATCH(1,(IndexMatch!A:A=VLOOKUP(H140,'Drop Down'!K:L,2,0))*(IndexMatch!B:B=L140),0)),\"Service Already Opened\"),\"N/A\")","v":"Service Already Opened"},0,{"$f":"IF(O140>VLOOKUP(L140,'Drop Down'!$A$3:$B$10,2,0),\"1\",\"0\")","v":"0"},0,{"$f":"SUM(Table1[[#This Row],[Case Aide Hours]],Table1[[#This Row],[Case Aide Travel Time]])","v":0},{"$f":"IFERROR(IF(OR(Table1[[#This Row],[Child Support Level]]=\"Support Services Lvl 1\", Table1[[#This Row],[Child Support Level]]=\"Support Services Lvl 2\",Table1[[#This Row],[Child Support Level]]=\"Select\"),\"Case Aid Not Allowed\", PRODUCT(Table1[[#This Row],[Total Case Aide]],VLOOKUP(Table1[[#This Row],[County Where Youth Resides]],'Drop Down'!K:M,3,0))),\"0\")","v":"Case Aid Not Allowed"},"No",0,0]
["Select","-","-","-","-","DD/MM/YYYY","DD/MM/YYYY","Select","Select",{"$f":"VLOOKUP(Table1[[#This Row],[DCYF Case Region]],'Drop Down'!$F$3:$G$9,2,0)","v":"Select"},"Select","Select","Select",{"$f":"IFERROR(IF(M141=\"No\",INDEX(IndexMatch!C:C,MATCH(1,(IndexMatch!A:A=VLOOKUP(H141,'Drop Down'!K:L,2,0))*(IndexMatch!B:B=L141),0)),\"Service Already Opened\"),\"N/A\")","v":"Service Already Opened"},0,{"$f":"IF(O141>VLOOKUP(L141,'Drop Down'!$A$3:$B$10,2,0),\"1\",\"0\")","v":"0"},0,{"$f":"SUM(Table1[[#This Row],[Case Aide Hours]],Table1[[#This Row],[Case Aide Travel Time]])","v":0},{"$f":"IFERROR(IF(OR(Table1[[#This Row],[Child Support Level]]=\"Support Services Lvl 1\", Table1[[#This Row],[Child Support Level]]=\"Support Services Lvl 2\",Table1[[#This Row],[Child Support Level]]=\"Select\"),\"Case Aid Not Allowed\", PRODUCT(Table1[[#This Row],[Total Case Aide]],VLOOKUP(Table1[[#This Row],[County Where Youth Resides]],'Drop Down'!K:M,3,0))),\"0\")","v":"Case Aid Not Allowed"},"No",0,0]
["Select","-","-","-","-","DD/MM/YYYY","DD/MM/YYYY","Select","Select",{"$f":"VLOOKUP(Table1[[#This Row],[DCYF Case Region]],'Drop Down'!$F$3:$G$9,2,0)","v":"Select"},"Select","Select","Select",{"$f":"IFERROR(IF(M142=\"No\",INDEX(IndexMatch!C:C,MATCH(1,(IndexMatch!A:A=VLOOKUP(H142,'Drop Down'!K:L,2,0))*(IndexMatch!B:B=L142),0)),\"Service Already Opened\"),\"N/A\")","v":"Service Already Opened"},0,{"$f":"IF(O142>VLOOKUP(L142,'Drop Down'!$A$3:$B$10,2,0),\"1\",\"0\")","v":"0"},0,{"$f":"SUM(Table1[[#This Row],[Case Aide Hours]],Table1[[#This Row],[Case Aide Travel Time]])","v":0},{"$f":"IFERROR(IF(OR(Table1[[#This Row],[Child Support Level]]=\"Support Services Lvl 1\", Table1[[#This Row],[Child Support Level]]=\"Support Services Lvl 2\",Table1[[#This Row],[Child Support Level]]=\"Select\"),\"Case Aid Not Allowed\", PRODUCT(Table1[[#This Row],[Total Case Aide]],VLOOKUP(Table1[[#This Row],[County Where Youth Resides]],'Drop Down'!K:M,3,0))),\"0\")","v":"Case Aid Not Allowed"},"No",0,0]
["Select","-","-","-","-","DD/MM/YYYY","DD/MM/YYYY","Select","Select",{"$f":"VLOOKUP(Table1[[#This Row],[DCYF Case Region]],'Drop Down'!$F$3:$G$9,2,0)","v":"Select"},"Select","Select","Select",{"$f":"IFERROR(IF(M143=\"No\",INDEX(IndexMatch!C:C,MATCH(1,(IndexMatch!A:A=VLOOKUP(H143,'Drop Down'!K:L,2,0))*(IndexMatch!B:B=L143),0)),\"Service Already Opened\"),\"N/A\")","v":"Service Already Opened"},0,{"$f":"IF(O143>VLOOKUP(L143,'Drop Down'!$A$3:$B$10,2,0),\"1\",\"0\")","v":"0"},0,{"$f":"SUM(Table1[[#This Row],[Case Aide Hours]],Table1[[#This Row],[Case Aide Travel Time]])","v":0},{"$f":"IFERROR(IF(OR(Table1[[#This Row],[Child Support Level]]=\"Support Services Lvl 1\", Table1[[#This Row],[Child Support Level]]=\"Support Services Lvl 2\",Table1[[#This Row],[Child Support Level]]=\"Select\"),\"Case Aid Not Allowed\", PRODUCT(Table1[[#This Row],[Total Case Aide]],VLOOKUP(Table1[[#This Row],[County Where Youth Resides]],'Drop Down'!K:M,3,0))),\"0\")","v":"Case Aid Not Allowed"},"No",0,0]
["Select","-","-","-","-","DD/MM/YYYY","DD/MM/YYYY","Select","Select",{"$f":"VLOOKUP(Table1[[#This Row],[DCYF Case Region]],'Drop Down'!$F$3:$G$9,2,0)","v":"Select"},"Select","Select","Select",{"$f":"IFERROR(IF(M144=\"No\",INDEX(IndexMatch!C:C,MATCH(1,(IndexMatch!A:A=VLOOKUP(H144,'Drop Down'!K:L,2,0))*(IndexMatch!B:B=L144),0)),\"Service Already Opened\"),\"N/A\")","v":"Service Already Opened"},0,{"$f":"IF(O144>VLOOKUP(L144,'Drop Down'!$A$3:$B$10,2,0),\"1\",\"0\")","v":"0"},0,{"$f":"SUM(Table1[[#This Row],[Case Aide Hours]],Table1[[#This Row],[Case Aide Travel Time]])","v":0},{"$f":"IFERROR(IF(OR(Table1[[#This Row],[Child Support Level]]=\"Support Services Lvl 1\", Table1[[#This Row],[Child Support Level]]=\"Support Services Lvl 2\",Table1[[#This Row],[Child Support Level]]=\"Select\"),\"Case Aid Not Allowed\", PRODUCT(Table1[[#This Row],[Total Case Aide]],VLOOKUP(Table1[[#This Row],[County Where Youth Resides]],'Drop Down'!K:M,3,0))),\"0\")","v":"Case Aid Not Allowed"},"No",0,0]
["Select","-","-","-","-","DD/MM/YYYY","DD/MM/YYYY","Select","Select",{"$f":"VLOOKUP(Table1[[#This Row],[DCYF Case Region]],'Drop Down'!$F$3:$G$9,2,0)","v":"Select"},"Select","Select","Select",{"$f":"IFERROR(IF(M145=\"No\",INDEX(IndexMatch!C:C,MATCH(1,(IndexMatch!A:A=VLOOKUP(H145,'Drop Down'!K:L,2,0))*(IndexMatch!B:B=L145),0)),\"Service Already Opened\"),\"N/A\")","v":"Service Already Opened"},0,{"$f":"IF(O145>VLOOKUP(L145,'Drop Down'!$A$3:$B$10,2,0),\"1\",\"0\")","v":"0"},0,{"$f":"SUM(Table1[[#This Row],[Case Aide Hours]],Table1[[#This Row],[Case Aide Travel Time]])","v":0},{"$f":"IFERROR(IF(OR(Table1[[#This Row],[Child Support Level]]=\"Support Services Lvl 1\", Table1[[#This Row],[Child Support Level]]=\"Support Services Lvl 2\",Table1[[#This Row],[Child Support Level]]=\"Select\"),\"Case Aid Not Allowed\", PRODUCT(Table1[[#This Row],[Total Case Aide]],VLOOKUP(Table1[[#This Row],[County Where Youth Resides]],'Drop Down'!K:M,3,0))),\"0\")","v":"Case Aid Not Allowed"},"No",0,0]
["Select","-","-","-","-","DD/MM/YYYY","DD/MM/YYYY","Select","Select",{"$f":"VLOOKUP(Table1[[#This Row],[DCYF Case Region]],'Drop Down'!$F$3:$G$9,2,0)","v":"Select"},"Select","Select","Select",{"$f":"IFERROR(IF(M146=\"No\",INDEX(IndexMatch!C:C,MATCH(1,(IndexMatch!A:A=VLOOKUP(H146,'Drop Down'!K:L,2,0))*(IndexMatch!B:B=L146),0)),\"Service Already Opened\"),\"N/A\")","v":"Service Already Opened"},0,{"$f":"IF(O146>VLOOKUP(L146,'Drop Down'!$A$3:$B$10,2,0),\"1\",\"0\")","v":"0"},0,{"$f":"SUM(Table1[[#This Row],[Case Aide Hours]],Table1[[#This Row],[Case Aide Travel Time]])","v":0},{"$f":"IFERROR(IF(OR(Table1[[#This Row],[Child Support Level]]=\"Support Services Lvl 1\", Table1[[#This Row],[Child Support Level]]=\"Support Services Lvl 2\",Table1[[#This Row],[Child Support Level]]=\"Select\"),\"Case Aid Not Allowed\", PRODUCT(Table1[[#This Row],[Total Case Aide]],VLOOKUP(Table1[[#This Row],[County Where Youth Resides]],'Drop Down'!K:M,3,0))),\"0\")","v":"Case Aid Not Allowed"},"No",0,0]
["Select","-","-","-","-","DD/MM/YYYY","DD/MM/YYYY","Select","Select",{"$f":"VLOOKUP(Table1[[#This Row],[DCYF Case Region]],'Drop Down'!$F$3:$G$9,2,0)","v":"Select"},"Select","Select","Select",{"$f":"IFERROR(IF(M147=\"No\",INDEX(IndexMatch!C:C,MATCH(1,(IndexMatch!A:A=VLOOKUP(H147,'Drop Down'!K:L,2,0))*(IndexMatch!B:B=L147),0)),\"Service Already Opened\"),\"N/A\")","v":"Service Already Opened"},0,{"$f":"IF(O147>VLOOKUP(L147,'Drop Down'!$A$3:$B$10,2,0),\"1\",\"0\")","v":"0"},0,{"$f":"SUM(Table1[[#This Row],[Case Aide Hours]],Table1[[#This Row],[Case Aide Travel Time]])","v":0},{"$f":"IFERROR(IF(OR(Table1[[#This Row],[Child Support Level]]=\"Support Services Lvl 1\", Table1[[#This Row],[Child Support Level]]=\"Support Services Lvl 2\",Table1[[#This Row],[Child Support Level]]=\"Select\"),\"Case Aid Not Allowed\", PRODUCT(Table1[[#This Row],[Total Case Aide]],VLOOKUP(Table1[[#This Row],[County Where Youth Resides]],'Drop Down'!K:M,3,0))),\"0\")","v":"Case Aid Not Allowed"},"No",0,0]
["Select","-","-","-","-","DD/MM/YYYY","DD/MM/YYYY","Select","Select",{"$f":"VLOOKUP(Table1[[#This Row],[DCYF Case Region]],'Drop Down'!$F$3:$G$9,2,0)","v":"Select"},"Select","Select","Select",{"$f":"IFERROR(IF(M148=\"No\",INDEX(IndexMatch!C:C,MATCH(1,(IndexMatch!A:A=VLOOKUP(H148,'Drop Down'!K:L,2,0))*(IndexMatch!B:B=L148),0)),\"Service Already Opened\"),\"N/A\")","v":"Service Already Opened"},0,{"$f":"IF(O148>VLOOKUP(L148,'Drop Down'!$A$3:$B$10,2,0),\"1\",\"0\")","v":"0"},0,{"$f":"SUM(Table1[[#This Row],[Case Aide Hours]],Table1[[#This Row],[Case Aide Travel Time]])","v":0},{"$f":"IFERROR(IF(OR(Table1[[#This Row],[Child Support Level]]=\"Support Services Lvl 1\", Table1[[#This Row],[Child Support Level]]=\"Support Services Lvl 2\",Table1[[#This Row],[Child Support Level]]=\"Select\"),\"Case Aid Not Allowed\", PRODUCT(Table1[[#This Row],[Total Case Aide]],VLOOKUP(Table1[[#This Row],[County Where Youth Resides]],'Drop Down'!K:M,3,0))),\"0\")","v":"Case Aid Not Allowed"},"No",0,0]
["Select","-","-","-","-","DD/MM/YYYY","DD/MM/YYYY","Select","Select",{"$f":"VLOOKUP(Table1[[#This Row],[DCYF Case Region]],'Drop Down'!$F$3:$G$9,2,0)","v":"Select"},"Select","Select","Select",{"$f":"IFERROR(IF(M149=\"No\",INDEX(IndexMatch!C:C,MATCH(1,(IndexMatch!A:A=VLOOKUP(H149,'Drop Down'!K:L,2,0))*(IndexMatch!B:B=L149),0)),\"Service Already Opened\"),\"N/A\")","v":"Service Already Opened"},0,{"$f":"IF(O149>VLOOKUP(L149,'Drop Down'!$A$3:$B$10,2,0),\"1\",\"0\")","v":"0"},0,{"$f":"SUM(Table1[[#This Row],[Case Aide Hours]],Table1[[#This Row],[Case Aide Travel Time]])","v":0},{"$f":"IFERROR(IF(OR(Table1[[#This Row],[Child Support Level]]=\"Support Services Lvl 1\", Table1[[#This Row],[Child Support Level]]=\"Support Services Lvl 2\",Table1[[#This Row],[Child Support Level]]=\"Select\"),\"Case Aid Not Allowed\", PRODUCT(Table1[[#This Row],[Total Case Aide]],VLOOKUP(Table1[[#This Row],[County Where Youth Resides]],'Drop Down'!K:M,3,0))),\"0\")","v":"Case Aid Not Allowed"},"No",0,0]
["Select","-","-","-","-","DD/MM/YYYY","DD/MM/YYYY","Select","Select",{"$f":"VLOOKUP(Table1[[#This Row],[DCYF Case Region]],'Drop Down'!$F$3:$G$9,2,0)","v":"Select"},"Select","Select","Select",{"$f":"IFERROR(IF(M150=\"No\",INDEX(IndexMatch!C:C,MATCH(1,(IndexMatch!A:A=VLOOKUP(H150,'Drop Down'!K:L,2,0))*(IndexMatch!B:B=L150),0)),\"Service Already Opened\"),\"N/A\")","v":"Service Already Opened"},0,{"$f":"IF(O150>VLOOKUP(L150,'Drop Down'!$A$3:$B$10,2,0),\"1\",\"0\")","v":"0"},0,{"$f":"SUM(Table1[[#This Row],[Case Aide Hours]],Table1[[#This Row],[Case Aide Travel Time]])","v":0},{"$f":"IFERROR(IF(OR(Table1[[#This Row],[Child Support Level]]=\"Support Services Lvl 1\", Table1[[#This Row],[Child Support Level]]=\"Support Services Lvl 2\",Table1[[#This Row],[Child Support Level]]=\"Select\"),\"Case Aid Not Allowed\", PRODUCT(Table1[[#This Row],[Total Case Aide]],VLOOKUP(Table1[[#This Row],[County Where Youth Resides]],'Drop Down'!K:M,3,0))),\"0\")","v":"Case Aid Not Allowed"},"No",0,0]
["Select","-","-","-","-","DD/MM/YYYY","DD/MM/YYYY","Select","Select",{"$f":"VLOOKUP(Table1[[#This Row],[DCYF Case Region]],'Drop Down'!$F$3:$G$9,2,0)","v":"Select"},"Select","Select","Select",{"$f":"IFERROR(IF(M151=\"No\",INDEX(IndexMatch!C:C,MATCH(1,(IndexMatch!A:A=VLOOKUP(H151,'Drop Down'!K:L,2,0))*(IndexMatch!B:B=L151),0)),\"Service Already Opened\"),\"N/A\")","v":"Service Already Opened"},0,{"$f":"IF(O151>VLOOKUP(L151,'Drop Down'!$A$3:$B$10,2,0),\"1\",\"0\")","v":"0"},0,{"$f":"SUM(Table1[[#This Row],[Case Aide Hours]],Table1[[#This Row],[Case Aide Travel Time]])","v":0},{"$f":"IFERROR(IF(OR(Table1[[#This Row],[Child Support Level]]=\"Support Services Lvl 1\", Table1[[#This Row],[Child Support Level]]=\"Support Services Lvl 2\",Table1[[#This Row],[Child Support Level]]=\"Select\"),\"Case Aid Not Allowed\", PRODUCT(Table1[[#This Row],[Total Case Aide]],VLOOKUP(Table1[[#This Row],[County Where Youth Resides]],'Drop Down'!K:M,3,0))),\"0\")","v":"Case Aid Not Allowed"},"No",0,0]
["Select","-","-","-","-","DD/MM/YYYY","DD/MM/YYYY","Select","Select",{"$f":"VLOOKUP(Table1[[#This Row],[DCYF Case Region]],'Drop Down'!$F$3:$G$9,2,0)","v":"Select"},"Select","Select","Select",{"$f":"IFERROR(IF(M152=\"No\",INDEX(IndexMatch!C:C,MATCH(1,(IndexMatch!A:A=VLOOKUP(H152,'Drop Down'!K:L,2,0))*(IndexMatch!B:B=L152),0)),\"Service Already Opened\"),\"N/A\")","v":"Service Already Opened"},0,{"$f":"IF(O152>VLOOKUP(L152,'Drop Down'!$A$3:$B$10,2,0),\"1\",\"0\")","v":"0"},0,{"$f":"SUM(Table1[[#This Row],[Case Aide Hours]],Table1[[#This Row],[Case Aide Travel Time]])","v":0},{"$f":"IFERROR(IF(OR(Table1[[#This Row],[Child Support Level]]=\"Support Services Lvl 1\", Table1[[#This Row],[Child Support Level]]=\"Support Services Lvl 2\",Table1[[#This Row],[Child Support Level]]=\"Select\"),\"Case Aid Not Allowed\", PRODUCT(Table1[[#This Row],[Total Case Aide]],VLOOKUP(Table1[[#This Row],[County Where Youth Resides]],'Drop Down'!K:M,3,0))),\"0\")","v":"Case Aid Not Allowed"},"No",0,0]
["Select","-","-","-","-","DD/MM/YYYY","DD/MM/YYYY","Select","Select",{"$f":"VLOOKUP(Table1[[#This Row],[DCYF Case Region]],'Drop Down'!$F$3:$G$9,2,0)","v":"Select"},"Select","Select","Select",{"$f":"IFERROR(IF(M153=\"No\",INDEX(IndexMatch!C:C,MATCH(1,(IndexMatch!A:A=VLOOKUP(H153,'Drop Down'!K:L,2,0))*(IndexMatch!B:B=L153),0)),\"Service Already Opened\"),\"N/A\")","v":"Service Already Opened"},0,{"$f":"IF(O153>VLOOKUP(L153,'Drop Down'!$A$3:$B$10,2,0),\"1\",\"0\")","v":"0"},0,{"$f":"SUM(Table1[[#This Row],[Case Aide Hours]],Table1[[#This Row],[Case Aide Travel Time]])","v":0},{"$f":"IFERROR(IF(OR(Table1[[#This Row],[Child Support Level]]=\"Support Services Lvl 1\", Table1[[#This Row],[Child Support Level]]=\"Support Services Lvl 2\",Table1[[#This Row],[Child Support Level]]=\"Select\"),\"Case Aid Not Allowed\", PRODUCT(Table1[[#This Row],[Total Case Aide]],VLOOKUP(Table1[[#This Row],[County Where Youth Resides]],'Drop Down'!K:M,3,0))),\"0\")","v":"Case Aid Not Allowed"},"No",0,0]
["Select","-","-","-","-","DD/MM/YYYY","DD/MM/YYYY","Select","Select",{"$f":"VLOOKUP(Table1[[#This Row],[DCYF Case Region]],'Drop Down'!$F$3:$G$9,2,0)","v":"Select"},"Select","Select","Select",{"$f":"IFERROR(IF(M154=\"No\",INDEX(IndexMatch!C:C,MATCH(1,(IndexMatch!A:A=VLOOKUP(H154,'Drop Down'!K:L,2,0))*(IndexMatch!B:B=L154),0)),\"Service Already Opened\"),\"N/A\")","v":"Service Already Opened"},0,{"$f":"IF(O154>VLOOKUP(L154,'Drop Down'!$A$3:$B$10,2,0),\"1\",\"0\")","v":"0"},0,{"$f":"SUM(Table1[[#This Row],[Case Aide Hours]],Table1[[#This Row],[Case Aide Travel Time]])","v":0},{"$f":"IFERROR(IF(OR(Table1[[#This Row],[Child Support Level]]=\"Support Services Lvl 1\", Table1[[#This Row],[Child Support Level]]=\"Support Services Lvl 2\",Table1[[#This Row],[Child Support Level]]=\"Select\"),\"Case Aid Not Allowed\", PRODUCT(Table1[[#This Row],[Total Case Aide]],VLOOKUP(Table1[[#This Row],[County Where Youth Resides]],'Drop Down'!K:M,3,0))),\"0\")","v":"Case Aid Not Allowed"},"No",0,0]
["Select","-","-","-","-","DD/MM/YYYY","DD/MM/YYYY","Select","Select",{"$f":"VLOOKUP(Table1[[#This Row],[DCYF Case Region]],'Drop Down'!$F$3:$G$9,2,0)","v":"Select"},"Select","Select","Select",{"$f":"IFERROR(IF(M155=\"No\",INDEX(IndexMatch!C:C,MATCH(1,(IndexMatch!A:A=VLOOKUP(H155,'Drop Down'!K:L,2,0))*(IndexMatch!B:B=L155),0)),\"Service Already Opened\"),\"N/A\")","v":"Service Already Opened"},0,{"$f":"IF(O155>VLOOKUP(L155,'Drop Down'!$A$3:$B$10,2,0),\"1\",\"0\")","v":"0"},0,{"$f":"SUM(Table1[[#This Row],[Case Aide Hours]],Table1[[#This Row],[Case Aide Travel Time]])","v":0},{"$f":"IFERROR(IF(OR(Table1[[#This Row],[Child Support Level]]=\"Support Services Lvl 1\", Table1[[#This Row],[Child Support Level]]=\"Support Services Lvl 2\",Table1[[#This Row],[Child Support Level]]=\"Select\"),\"Case Aid Not Allowed\", PRODUCT(Table1[[#This Row],[Total Case Aide]],VLOOKUP(Table1[[#This Row],[County Where Youth Resides]],'Drop Down'!K:M,3,0))),\"0\")","v":"Case Aid Not Allowed"},"No",0,0]
["Select","-","-","-","-","DD/MM/YYYY","DD/MM/YYYY","Select","Select",{"$f":"VLOOKUP(Table1[[#This Row],[DCYF Case Region]],'Drop Down'!$F$3:$G$9,2,0)","v":"Select"},"Select","Select","Select",{"$f":"IFERROR(IF(M156=\"No\",INDEX(IndexMatch!C:C,MATCH(1,(IndexMatch!A:A=VLOOKUP(H156,'Drop Down'!K:L,2,0))*(IndexMatch!B:B=L156),0)),\"Service Already Opened\"),\"N/A\")","v":"Service Already Opened"},0,{"$f":"IF(O156>VLOOKUP(L156,'Drop Down'!$A$3:$B$10,2,0),\"1\",\"0\")","v":"0"},0,{"$f":"SUM(Table1[[#This Row],[Case Aide Hours]],Table1[[#This Row],[Case Aide Travel Time]])","v":0},{"$f":"IFERROR(IF(OR(Table1[[#This Row],[Child Support Level]]=\"Support Services Lvl 1\", Table1[[#This Row],[Child Support Level]]=\"Support Services Lvl 2\",Table1[[#This Row],[Child Support Level]]=\"Select\"),\"Case Aid Not Allowed\", PRODUCT(Table1[[#This Row],[Total Case Aide]],VLOOKUP(Table1[[#This Row],[County Where Youth Resides]],'Drop Down'!K:M,3,0))),\"0\")","v":"Case Aid Not Allowed"},"No",0,0]
["Select","-","-","-","-","DD/MM/YYYY","DD/MM/YYYY","Select","Select",{"$f":"VLOOKUP(Table1[[#This Row],[DCYF Case Region]],'Drop Down'!$F$3:$G$9,2,0)","v":"Select"},"Select","Select","Select",{"$f":"IFERROR(IF(M157=\"No\",INDEX(IndexMatch!C:C,MATCH(1,(IndexMatch!A:A=VLOOKUP(H157,'Drop Down'!K:L,2,0))*(IndexMatch!B:B=L157),0)),\"Service Already Opened\"),\"N/A\")","v":"Service Already Opened"},0,{"$f":"IF(O157>VLOOKUP(L157,'Drop Down'!$A$3:$B$10,2,0),\"1\",\"0\")","v":"0"},0,{"$f":"SUM(Table1[[#This Row],[Case Aide Hours]],Table1[[#This Row],[Case Aide Travel Time]])","v":0},{"$f":"IFERROR(IF(OR(Table1[[#This Row],[Child Support Level]]=\"Support Services Lvl 1\", Table1[[#This Row],[Child Support Level]]=\"Support Services Lvl 2\",Table1[[#This Row],[Child Support Level]]=\"Select\"),\"Case Aid Not Allowed\", PRODUCT(Table1[[#This Row],[Total Case Aide]],VLOOKUP(Table1[[#This Row],[County Where Youth Resides]],'Drop Down'!K:M,3,0))),\"0\")","v":"Case Aid Not Allowed"},"No",0,0]
["Select","-","-","-","-","DD/MM/YYYY","DD/MM/YYYY","Select","Select",{"$f":"VLOOKUP(Table1[[#This Row],[DCYF Case Region]],'Drop Down'!$F$3:$G$9,2,0)","v":"Select"},"Select","Select","Select",{"$f":"IFERROR(IF(M158=\"No\",INDEX(IndexMatch!C:C,MATCH(1,(IndexMatch!A:A=VLOOKUP(H158,'Drop Down'!K:L,2,0))*(IndexMatch!B:B=L158),0)),\"Service Already Opened\"),\"N/A\")","v":"Service Already Opened"},0,{"$f":"IF(O158>VLOOKUP(L158,'Drop Down'!$A$3:$B$10,2,0),\"1\",\"0\")","v":"0"},0,{"$f":"SUM(Table1[[#This Row],[Case Aide Hours]],Table1[[#This Row],[Case Aide Travel Time]])","v":0},{"$f":"IFERROR(IF(OR(Table1[[#This Row],[Child Support Level]]=\"Support Services Lvl 1\", Table1[[#This Row],[Child Support Level]]=\"Support Services Lvl 2\",Table1[[#This Row],[Child Support Level]]=\"Select\"),\"Case Aid Not Allowed\", PRODUCT(Table1[[#This Row],[Total Case Aide]],VLOOKUP(Table1[[#This Row],[County Where Youth Resides]],'Drop Down'!K:M,3,0))),\"0\")","v":"Case Aid Not Allowed"},"No",0,0]
["Select","-","-","-","-","DD/MM/YYYY","DD/MM/YYYY","Select","Select",{"$f":"VLOOKUP(Table1[[#This Row],[DCYF Case Region]],'Drop Down'!$F$3:$G$9,2,0)","v":"Select"},"Select","Select","Select",{"$f":"IFERROR(IF(M159=\"No\",INDEX(IndexMatch!C:C,MATCH(1,(IndexMatch!A:A=VLOOKUP(H159,'Drop Down'!K:L,2,0))*(IndexMatch!B:B=L159),0)),\"Service Already Opened\"),\"N/A\")","v":"Service Already Opened"},0,{"$f":"IF(O159>VLOOKUP(L159,'Drop Down'!$A$3:$B$10,2,0),\"1\",\"0\")","v":"0"},0,{"$f":"SUM(Table1[[#This Row],[Case Aide Hours]],Table1[[#This Row],[Case Aide Travel Time]])","v":0},{"$f":"IFERROR(IF(OR(Table1[[#This Row],[Child Support Level]]=\"Support Services Lvl 1\", Table1[[#This Row],[Child Support Level]]=\"Support Services Lvl 2\",Table1[[#This Row],[Child Support Level]]=\"Select\"),\"Case Aid Not Allowed\", PRODUCT(Table1[[#This Row],[Total Case Aide]],VLOOKUP(Table1[[#This Row],[County Where Youth Resides]],'Drop Down'!K:M,3,0))),\"0\")","v":"Case Aid Not Allowed"},"No",0,0]
["Select","-","-","-","-","DD/MM/YYYY","DD/MM/YYYY","Select","Select",{"$f":"VLOOKUP(Table1[[#This Row],[DCYF Case Region]],'Drop Down'!$F$3:$G$9,2,0)","v":"Select"},"Select","Select","Select",{"$f":"IFERROR(IF(M160=\"No\",INDEX(IndexMatch!C:C,MATCH(1,(IndexMatch!A:A=VLOOKUP(H160,'Drop Down'!K:L,2,0))*(IndexMatch!B:B=L160),0)),\"Service Already Opened\"),\"N/A\")","v":"Service Already Opened"},0,{"$f":"IF(O160>VLOOKUP(L160,'Drop Down'!$A$3:$B$10,2,0),\"1\",\"0\")","v":"0"},0,{"$f":"SUM(Table1[[#This Row],[Case Aide Hours]],Table1[[#This Row],[Case Aide Travel Time]])","v":0},{"$f":"IFERROR(IF(OR(Table1[[#This Row],[Child Support Level]]=\"Support Services Lvl 1\", Table1[[#This Row],[Child Support Level]]=\"Support Services Lvl 2\",Table1[[#This Row],[Child Support Level]]=\"Select\"),\"Case Aid Not Allowed\", PRODUCT(Table1[[#This Row],[Total Case Aide]],VLOOKUP(Table1[[#This Row],[County Where Youth Resides]],'Drop Down'!K:M,3,0))),\"0\")","v":"Case Aid Not Allowed"},"No",0,0]
["Select","-","-","-","-","DD/MM/YYYY","DD/MM/YYYY","Select","Select",{"$f":"VLOOKUP(Table1[[#This Row],[DCYF Case Region]],'Drop Down'!$F$3:$G$9,2,0)","v":"Select"},"Select","Select","Select",{"$f":"IFERROR(IF(M161=\"No\",INDEX(IndexMatch!C:C,MATCH(1,(IndexMatch!A:A=VLOOKUP(H161,'Drop Down'!K:L,2,0))*(IndexMatch!B:B=L161),0)),\"Service Already Opened\"),\"N/A\")","v":"Service Already Opened"},0,{"$f":"IF(O161>VLOOKUP(L161,'Drop Down'!$A$3:$B$10,2,0),\"1\",\"0\")","v":"0"},0,{"$f":"SUM(Table1[[#This Row],[Case Aide Hours]],Table1[[#This Row],[Case Aide Travel Time]])","v":0},{"$f":"IFERROR(IF(OR(Table1[[#This Row],[Child Support Level]]=\"Support Services Lvl 1\", Table1[[#This Row],[Child Support Level]]=\"Support Services Lvl 2\",Table1[[#This Row],[Child Support Level]]=\"Select\"),\"Case Aid Not Allowed\", PRODUCT(Table1[[#This Row],[Total Case Aide]],VLOOKUP(Table1[[#This Row],[County Where Youth Resides]],'Drop Down'!K:M,3,0))),\"0\")","v":"Case Aid Not Allowed"},"No",0,0]
["Select","-","-","-","-","DD/MM/YYYY","DD/MM/YYYY","Select","Select",{"$f":"VLOOKUP(Table1[[#This Row],[DCYF Case Region]],'Drop Down'!$F$3:$G$9,2,0)","v":"Select"},"Select","Select","Select",{"$f":"IFERROR(IF(M162=\"No\",INDEX(IndexMatch!C:C,MATCH(1,(IndexMatch!A:A=VLOOKUP(H162,'Drop Down'!K:L,2,0))*(IndexMatch!B:B=L162),0)),\"Service Already Opened\"),\"N/A\")","v":"Service Already Opened"},0,{"$f":"IF(O162>VLOOKUP(L162,'Drop Down'!$A$3:$B$10,2,0),\"1\",\"0\")","v":"0"},0,{"$f":"SUM(Table1[[#This Row],[Case Aide Hours]],Table1[[#This Row],[Case Aide Travel Time]])","v":0},{"$f":"IFERROR(IF(OR(Table1[[#This Row],[Child Support Level]]=\"Support Services Lvl 1\", Table1[[#This Row],[Child Support Level]]=\"Support Services Lvl 2\",Table1[[#This Row],[Child Support Level]]=\"Select\"),\"Case Aid Not Allowed\", PRODUCT(Table1[[#This Row],[Total Case Aide]],VLOOKUP(Table1[[#This Row],[County Where Youth Resides]],'Drop Down'!K:M,3,0))),\"0\")","v":"Case Aid Not Allowed"},"No",0,0]
["Select","-","-","-","-","DD/MM/YYYY","DD/MM/YYYY","Select","Select",{"$f":"VLOOKUP(Table1[[#This Row],[DCYF Case Region]],'Drop Down'!$F$3:$G$9,2,0)","v":"Select"},"Select","Select","Select",{"$f":"IFERROR(IF(M163=\"No\",INDEX(IndexMatch!C:C,MATCH(1,(IndexMatch!A:A=VLOOKUP(H163,'Drop Down'!K:L,2,0))*(IndexMatch!B:B=L163),0)),\"Service Already Opened\"),\"N/A\")","v":"Service Already Opened"},0,{"$f":"IF(O163>VLOOKUP(L163,'Drop Down'!$A$3:$B$10,2,0),\"1\",\"0\")","v":"0"},0,{"$f":"SUM(Table1[[#This Row],[Case Aide Hours]],Table1[[#This Row],[Case Aide Travel Time]])","v":0},{"$f":"IFERROR(IF(OR(Table1[[#This Row],[Child Support Level]]=\"Support Services Lvl 1\", Table1[[#This Row],[Child Support Level]]=\"Support Services Lvl 2\",Table1[[#This Row],[Child Support Level]]=\"Select\"),\"Case Aid Not Allowed\", PRODUCT(Table1[[#This Row],[Total Case Aide]],VLOOKUP(Table1[[#This Row],[County Where Youth Resides]],'Drop Down'!K:M,3,0))),\"0\")","v":"Case Aid Not Allowed"},"No",0,0]
["Select","-","-","-","-","DD/MM/YYYY","DD/MM/YYYY","Select","Select",{"$f":"VLOOKUP(Table1[[#This Row],[DCYF Case Region]],'Drop Down'!$F$3:$G$9,2,0)","v":"Select"},"Select","Select","Select",{"$f":"IFERROR(IF(M164=\"No\",INDEX(IndexMatch!C:C,MATCH(1,(IndexMatch!A:A=VLOOKUP(H164,'Drop Down'!K:L,2,0))*(IndexMatch!B:B=L164),0)),\"Service Already Opened\"),\"N/A\")","v":"Service Already Opened"},0,{"$f":"IF(O164>VLOOKUP(L164,'Drop Down'!$A$3:$B$10,2,0),\"1\",\"0\")","v":"0"},0,{"$f":"SUM(Table1[[#This Row],[Case Aide Hours]],Table1[[#This Row],[Case Aide Travel Time]])","v":0},{"$f":"IFERROR(IF(OR(Table1[[#This Row],[Child Support Level]]=\"Support Services Lvl 1\", Table1[[#This Row],[Child Support Level]]=\"Support Services Lvl 2\",Table1[[#This Row],[Child Support Level]]=\"Select\"),\"Case Aid Not Allowed\", PRODUCT(Table1[[#This Row],[Total Case Aide]],VLOOKUP(Table1[[#This Row],[County Where Youth Resides]],'Drop Down'!K:M,3,0))),\"0\")","v":"Case Aid Not Allowed"},"No",0,0]
["Select","-","-","-","-","DD/MM/YYYY","DD/MM/YYYY","Select","Select",{"$f":"VLOOKUP(Table1[[#This Row],[DCYF Case Region]],'Drop Down'!$F$3:$G$9,2,0)","v":"Select"},"Select","Select","Select",{"$f":"IFERROR(IF(M165=\"No\",INDEX(IndexMatch!C:C,MATCH(1,(IndexMatch!A:A=VLOOKUP(H165,'Drop Down'!K:L,2,0))*(IndexMatch!B:B=L165),0)),\"Service Already Opened\"),\"N/A\")","v":"Service Already Opened"},0,{"$f":"IF(O165>VLOOKUP(L165,'Drop Down'!$A$3:$B$10,2,0),\"1\",\"0\")","v":"0"},0,{"$f":"SUM(Table1[[#This Row],[Case Aide Hours]],Table1[[#This Row],[Case Aide Travel Time]])","v":0},{"$f":"IFERROR(IF(OR(Table1[[#This Row],[Child Support Level]]=\"Support Services Lvl 1\", Table1[[#This Row],[Child Support Level]]=\"Support Services Lvl 2\",Table1[[#This Row],[Child Support Level]]=\"Select\"),\"Case Aid Not Allowed\", PRODUCT(Table1[[#This Row],[Total Case Aide]],VLOOKUP(Table1[[#This Row],[County Where Youth Resides]],'Drop Down'!K:M,3,0))),\"0\")","v":"Case Aid Not Allowed"},"No",0,0]
["Select","-","-","-","-","DD/MM/YYYY","DD/MM/YYYY","Select","Select",{"$f":"VLOOKUP(Table1[[#This Row],[DCYF Case Region]],'Drop Down'!$F$3:$G$9,2,0)","v":"Select"},"Select","Select","Select",{"$f":"IFERROR(IF(M166=\"No\",INDEX(IndexMatch!C:C,MATCH(1,(IndexMatch!A:A=VLOOKUP(H166,'Drop Down'!K:L,2,0))*(IndexMatch!B:B=L166),0)),\"Service Already Opened\"),\"N/A\")","v":"Service Already Opened"},0,{"$f":"IF(O166>VLOOKUP(L166,'Drop Down'!$A$3:$B$10,2,0),\"1\",\"0\")","v":"0"},0,{"$f":"SUM(Table1[[#This Row],[Case Aide Hours]],Table1[[#This Row],[Case Aide Travel Time]])","v":0},{"$f":"IFERROR(IF(OR(Table1[[#This Row],[Child Support Level]]=\"Support Services Lvl 1\", Table1[[#This Row],[Child Support Level]]=\"Support Services Lvl 2\",Table1[[#This Row],[Child Support Level]]=\"Select\"),\"Case Aid Not Allowed\", PRODUCT(Table1[[#This Row],[Total Case Aide]],VLOOKUP(Table1[[#This Row],[County Where Youth Resides]],'Drop Down'!K:M,3,0))),\"0\")","v":"Case Aid Not Allowed"},"No",0,0]
["Select","-","-","-","-","DD/MM/YYYY","DD/MM/YYYY","Select","Select",{"$f":"VLOOKUP(Table1[[#This Row],[DCYF Case Region]],'Drop Down'!$F$3:$G$9,2,0)","v":"Select"},"Select","Select","Select",{"$f":"IFERROR(IF(M167=\"No\",INDEX(IndexMatch!C:C,MATCH(1,(IndexMatch!A:A=VLOOKUP(H167,'Drop Down'!K:L,2,0))*(IndexMatch!B:B=L167),0)),\"Service Already Opened\"),\"N/A\")","v":"Service Already Opened"},0,{"$f":"IF(O167>VLOOKUP(L167,'Drop Down'!$A$3:$B$10,2,0),\"1\",\"0\")","v":"0"},0,{"$f":"SUM(Table1[[#This Row],[Case Aide Hours]],Table1[[#This Row],[Case Aide Travel Time]])","v":0},{"$f":"IFERROR(IF(OR(Table1[[#This Row],[Child Support Level]]=\"Support Services Lvl 1\", Table1[[#This Row],[Child Support Level]]=\"Support Services Lvl 2\",Table1[[#This Row],[Child Support Level]]=\"Select\"),\"Case Aid Not Allowed\", PRODUCT(Table1[[#This Row],[Total Case Aide]],VLOOKUP(Table1[[#This Row],[County Where Youth Resides]],'Drop Down'!K:M,3,0))),\"0\")","v":"Case Aid Not Allowed"},"No",0,0]
["Select","-","-","-","-","DD/MM/YYYY","DD/MM/YYYY","Select","Select",{"$f":"VLOOKUP(Table1[[#This Row],[DCYF Case Region]],'Drop Down'!$F$3:$G$9,2,0)","v":"Select"},"Select","Select","Select",{"$f":"IFERROR(IF(M168=\"No\",INDEX(IndexMatch!C:C,MATCH(1,(IndexMatch!A:A=VLOOKUP(H168,'Drop Down'!K:L,2,0))*(IndexMatch!B:B=L168),0)),\"Service Already Opened\"),\"N/A\")","v":"Service Already Opened"},0,{"$f":"IF(O168>VLOOKUP(L168,'Drop Down'!$A$3:$B$10,2,0),\"1\",\"0\")","v":"0"},0,{"$f":"SUM(Table1[[#This Row],[Case Aide Hours]],Table1[[#This Row],[Case Aide Travel Time]])","v":0},{"$f":"IFERROR(IF(OR(Table1[[#This Row],[Child Support Level]]=\"Support Services Lvl 1\", Table1[[#This Row],[Child Support Level]]=\"Support Services Lvl 2\",Table1[[#This Row],[Child Support Level]]=\"Select\"),\"Case Aid Not Allowed\", PRODUCT(Table1[[#This Row],[Total Case Aide]],VLOOKUP(Table1[[#This Row],[County Where Youth Resides]],'Drop Down'!K:M,3,0))),\"0\")","v":"Case Aid Not Allowed"},"No",0,0]
["Select","-","-","-","-","DD/MM/YYYY","DD/MM/YYYY","Select","Select",{"$f":"VLOOKUP(Table1[[#This Row],[DCYF Case Region]],'Drop Down'!$F$3:$G$9,2,0)","v":"Select"},"Select","Select","Select",{"$f":"IFERROR(IF(M169=\"No\",INDEX(IndexMatch!C:C,MATCH(1,(IndexMatch!A:A=VLOOKUP(H169,'Drop Down'!K:L,2,0))*(IndexMatch!B:B=L169),0)),\"Service Already Opened\"),\"N/A\")","v":"Service Already Opened"},0,{"$f":"IF(O169>VLOOKUP(L169,'Drop Down'!$A$3:$B$10,2,0),\"1\",\"0\")","v":"0"},0,{"$f":"SUM(Table1[[#This Row],[Case Aide Hours]],Table1[[#This Row],[Case Aide Travel Time]])","v":0},{"$f":"IFERROR(IF(OR(Table1[[#This Row],[Child Support Level]]=\"Support Services Lvl 1\", Table1[[#This Row],[Child Support Level]]=\"Support Services Lvl 2\",Table1[[#This Row],[Child Support Level]]=\"Select\"),\"Case Aid Not Allowed\", PRODUCT(Table1[[#This Row],[Total Case Aide]],VLOOKUP(Table1[[#This Row],[County Where Youth Resides]],'Drop Down'!K:M,3,0))),\"0\")","v":"Case Aid Not Allowed"},"No",0,0]
["Select","-","-","-","-","DD/MM/YYYY","DD/MM/YYYY","Select","Select",{"$f":"VLOOKUP(Table1[[#This Row],[DCYF Case Region]],'Drop Down'!$F$3:$G$9,2,0)","v":"Select"},"Select","Select","Select",{"$f":"IFERROR(IF(M170=\"No\",INDEX(IndexMatch!C:C,MATCH(1,(IndexMatch!A:A=VLOOKUP(H170,'Drop Down'!K:L,2,0))*(IndexMatch!B:B=L170),0)),\"Service Already Opened\"),\"N/A\")","v":"Service Already Opened"},0,{"$f":"IF(O170>VLOOKUP(L170,'Drop Down'!$A$3:$B$10,2,0),\"1\",\"0\")","v":"0"},0,{"$f":"SUM(Table1[[#This Row],[Case Aide Hours]],Table1[[#This Row],[Case Aide Travel Time]])","v":0},{"$f":"IFERROR(IF(OR(Table1[[#This Row],[Child Support Level]]=\"Support Services Lvl 1\", Table1[[#This Row],[Child Support Level]]=\"Support Services Lvl 2\",Table1[[#This Row],[Child Support Level]]=\"Select\"),\"Case Aid Not Allowed\", PRODUCT(Table1[[#This Row],[Total Case Aide]],VLOOKUP(Table1[[#This Row],[County Where Youth Resides]],'Drop Down'!K:M,3,0))),\"0\")","v":"Case Aid Not Allowed"},"No",0,0]
["Select","-","-","-","-","DD/MM/YYYY","DD/MM/YYYY","Select","Select",{"$f":"VLOOKUP(Table1[[#This Row],[DCYF Case Region]],'Drop Down'!$F$3:$G$9,2,0)","v":"Select"},"Select","Select","Select",{"$f":"IFERROR(IF(M171=\"No\",INDEX(IndexMatch!C:C,MATCH(1,(IndexMatch!A:A=VLOOKUP(H171,'Drop Down'!K:L,2,0))*(IndexMatch!B:B=L171),0)),\"Service Already Opened\"),\"N/A\")","v":"Service Already Opened"},0,{"$f":"IF(O171>VLOOKUP(L171,'Drop Down'!$A$3:$B$10,2,0),\"1\",\"0\")","v":"0"},0,{"$f":"SUM(Table1[[#This Row],[Case Aide Hours]],Table1[[#This Row],[Case Aide Travel Time]])","v":0},{"$f":"IFERROR(IF(OR(Table1[[#This Row],[Child Support Level]]=\"Support Services Lvl 1\", Table1[[#This Row],[Child Support Level]]=\"Support Services Lvl 2\",Table1[[#This Row],[Child Support Level]]=\"Select\"),\"Case Aid Not Allowed\", PRODUCT(Table1[[#This Row],[Total Case Aide]],VLOOKUP(Table1[[#This Row],[County Where Youth Resides]],'Drop Down'!K:M,3,0))),\"0\")","v":"Case Aid Not Allowed"},"No",0,0]
["Select","-","-","-","-","DD/MM/YYYY","DD/MM/YYYY","Select","Select",{"$f":"VLOOKUP(Table1[[#This Row],[DCYF Case Region]],'Drop Down'!$F$3:$G$9,2,0)","v":"Select"},"Select","Select","Select",{"$f":"IFERROR(IF(M172=\"No\",INDEX(IndexMatch!C:C,MATCH(1,(IndexMatch!A:A=VLOOKUP(H172,'Drop Down'!K:L,2,0))*(IndexMatch!B:B=L172),0)),\"Service Already Opened\"),\"N/A\")","v":"Service Already Opened"},0,{"$f":"IF(O172>VLOOKUP(L172,'Drop Down'!$A$3:$B$10,2,0),\"1\",\"0\")","v":"0"},0,{"$f":"SUM(Table1[[#This Row],[Case Aide Hours]],Table1[[#This Row],[Case Aide Travel Time]])","v":0},{"$f":"IFERROR(IF(OR(Table1[[#This Row],[Child Support Level]]=\"Support Services Lvl 1\", Table1[[#This Row],[Child Support Level]]=\"Support Services Lvl 2\",Table1[[#This Row],[Child Support Level]]=\"Select\"),\"Case Aid Not Allowed\", PRODUCT(Table1[[#This Row],[Total Case Aide]],VLOOKUP(Table1[[#This Row],[County Where Youth Resides]],'Drop Down'!K:M,3,0))),\"0\")","v":"Case Aid Not Allowed"},"No",0,0]
["Select","-","-","-","-","DD/MM/YYYY","DD/MM/YYYY","Select","Select",{"$f":"VLOOKUP(Table1[[#This Row],[DCYF Case Region]],'Drop Down'!$F$3:$G$9,2,0)","v":"Select"},"Select","Select","Select",{"$f":"IFERROR(IF(M173=\"No\",INDEX(IndexMatch!C:C,MATCH(1,(IndexMatch!A:A=VLOOKUP(H173,'Drop Down'!K:L,2,0))*(IndexMatch!B:B=L173),0)),\"Service Already Opened\"),\"N/A\")","v":"Service Already Opened"},0,{"$f":"IF(O173>VLOOKUP(L173,'Drop Down'!$A$3:$B$10,2,0),\"1\",\"0\")","v":"0"},0,{"$f":"SUM(Table1[[#This Row],[Case Aide Hours]],Table1[[#This Row],[Case Aide Travel Time]])","v":0},{"$f":"IFERROR(IF(OR(Table1[[#This Row],[Child Support Level]]=\"Support Services Lvl 1\", Table1[[#This Row],[Child Support Level]]=\"Support Services Lvl 2\",Table1[[#This Row],[Child Support Level]]=\"Select\"),\"Case Aid Not Allowed\", PRODUCT(Table1[[#This Row],[Total Case Aide]],VLOOKUP(Table1[[#This Row],[County Where Youth Resides]],'Drop Down'!K:M,3,0))),\"0\")","v":"Case Aid Not Allowed"},"No",0,0]
["Select","-","-","-","-","DD/MM/YYYY","DD/MM/YYYY","Select","Select",{"$f":"VLOOKUP(Table1[[#This Row],[DCYF Case Region]],'Drop Down'!$F$3:$G$9,2,0)","v":"Select"},"Select","Select","Select",{"$f":"IFERROR(IF(M174=\"No\",INDEX(IndexMatch!C:C,MATCH(1,(IndexMatch!A:A=VLOOKUP(H174,'Drop Down'!K:L,2,0))*(IndexMatch!B:B=L174),0)),\"Service Already Opened\"),\"N/A\")","v":"Service Already Opened"},0,{"$f":"IF(O174>VLOOKUP(L174,'Drop Down'!$A$3:$B$10,2,0),\"1\",\"0\")","v":"0"},0,{"$f":"SUM(Table1[[#This Row],[Case Aide Hours]],Table1[[#This Row],[Case Aide Travel Time]])","v":0},{"$f":"IFERROR(IF(OR(Table1[[#This Row],[Child Support Level]]=\"Support Services Lvl 1\", Table1[[#This Row],[Child Support Level]]=\"Support Services Lvl 2\",Table1[[#This Row],[Child Support Level]]=\"Select\"),\"Case Aid Not Allowed\", PRODUCT(Table1[[#This Row],[Total Case Aide]],VLOOKUP(Table1[[#This Row],[County Where Youth Resides]],'Drop Down'!K:M,3,0))),\"0\")","v":"Case Aid Not Allowed"},"No",0,0]
["Select","-","-","-","-","DD/MM/YYYY","DD/MM/YYYY","Select","Select",{"$f":"VLOOKUP(Table1[[#This Row],[DCYF Case Region]],'Drop Down'!$F$3:$G$9,2,0)","v":"Select"},"Select","Select","Select",{"$f":"IFERROR(IF(M175=\"No\",INDEX(IndexMatch!C:C,MATCH(1,(IndexMatch!A:A=VLOOKUP(H175,'Drop Down'!K:L,2,0))*(IndexMatch!B:B=L175),0)),\"Service Already Opened\"),\"N/A\")","v":"Service Already Opened"},0,{"$f":"IF(O175>VLOOKUP(L175,'Drop Down'!$A$3:$B$10,2,0),\"1\",\"0\")","v":"0"},0,{"$f":"SUM(Table1[[#This Row],[Case Aide Hours]],Table1[[#This Row],[Case Aide Travel Time]])","v":0},{"$f":"IFERROR(IF(OR(Table1[[#This Row],[Child Support Level]]=\"Support Services Lvl 1\", Table1[[#This Row],[Child Support Level]]=\"Support Services Lvl 2\",Table1[[#This Row],[Child Support Level]]=\"Select\"),\"Case Aid Not Allowed\", PRODUCT(Table1[[#This Row],[Total Case Aide]],VLOOKUP(Table1[[#This Row],[County Where Youth Resides]],'Drop Down'!K:M,3,0))),\"0\")","v":"Case Aid Not Allowed"},"No",0,0]
["Select","-","-","-","-","DD/MM/YYYY","DD/MM/YYYY","Select","Select",{"$f":"VLOOKUP(Table1[[#This Row],[DCYF Case Region]],'Drop Down'!$F$3:$G$9,2,0)","v":"Select"},"Select","Select","Select",{"$f":"IFERROR(IF(M176=\"No\",INDEX(IndexMatch!C:C,MATCH(1,(IndexMatch!A:A=VLOOKUP(H176,'Drop Down'!K:L,2,0))*(IndexMatch!B:B=L176),0)),\"Service Already Opened\"),\"N/A\")","v":"Service Already Opened"},0,{"$f":"IF(O176>VLOOKUP(L176,'Drop Down'!$A$3:$B$10,2,0),\"1\",\"0\")","v":"0"},0,{"$f":"SUM(Table1[[#This Row],[Case Aide Hours]],Table1[[#This Row],[Case Aide Travel Time]])","v":0},{"$f":"IFERROR(IF(OR(Table1[[#This Row],[Child Support Level]]=\"Support Services Lvl 1\", Table1[[#This Row],[Child Support Level]]=\"Support Services Lvl 2\",Table1[[#This Row],[Child Support Level]]=\"Select\"),\"Case Aid Not Allowed\", PRODUCT(Table1[[#This Row],[Total Case Aide]],VLOOKUP(Table1[[#This Row],[County Where Youth Resides]],'Drop Down'!K:M,3,0))),\"0\")","v":"Case Aid Not Allowed"},"No",0,0]
["Select","-","-","-","-","DD/MM/YYYY","DD/MM/YYYY","Select","Select",{"$f":"VLOOKUP(Table1[[#This Row],[DCYF Case Region]],'Drop Down'!$F$3:$G$9,2,0)","v":"Select"},"Select","Select","Select",{"$f":"IFERROR(IF(M177=\"No\",INDEX(IndexMatch!C:C,MATCH(1,(IndexMatch!A:A=VLOOKUP(H177,'Drop Down'!K:L,2,0))*(IndexMatch!B:B=L177),0)),\"Service Already Opened\"),\"N/A\")","v":"Service Already Opened"},0,{"$f":"IF(O177>VLOOKUP(L177,'Drop Down'!$A$3:$B$10,2,0),\"1\",\"0\")","v":"0"},0,{"$f":"SUM(Table1[[#This Row],[Case Aide Hours]],Table1[[#This Row],[Case Aide Travel Time]])","v":0},{"$f":"IFERROR(IF(OR(Table1[[#This Row],[Child Support Level]]=\"Support Services Lvl 1\", Table1[[#This Row],[Child Support Level]]=\"Support Services Lvl 2\",Table1[[#This Row],[Child Support Level]]=\"Select\"),\"Case Aid Not Allowed\", PRODUCT(Table1[[#This Row],[Total Case Aide]],VLOOKUP(Table1[[#This Row],[County Where Youth Resides]],'Drop Down'!K:M,3,0))),\"0\")","v":"Case Aid Not Allowed"},"No",0,0]
["Select","-","-","-","-","DD/MM/YYYY","DD/MM/YYYY","Select","Select",{"$f":"VLOOKUP(Table1[[#This Row],[DCYF Case Region]],'Drop Down'!$F$3:$G$9,2,0)","v":"Select"},"Select","Select","Select",{"$f":"IFERROR(IF(M178=\"No\",INDEX(IndexMatch!C:C,MATCH(1,(IndexMatch!A:A=VLOOKUP(H178,'Drop Down'!K:L,2,0))*(IndexMatch!B:B=L178),0)),\"Service Already Opened\"),\"N/A\")","v":"Service Already Opened"},0,{"$f":"IF(O178>VLOOKUP(L178,'Drop Down'!$A$3:$B$10,2,0),\"1\",\"0\")","v":"0"},0,{"$f":"SUM(Table1[[#This Row],[Case Aide Hours]],Table1[[#This Row],[Case Aide Travel Time]])","v":0},{"$f":"IFERROR(IF(OR(Table1[[#This Row],[Child Support Level]]=\"Support Services Lvl 1\", Table1[[#This Row],[Child Support Level]]=\"Support Services Lvl 2\",Table1[[#This Row],[Child Support Level]]=\"Select\"),\"Case Aid Not Allowed\", PRODUCT(Table1[[#This Row],[Total Case Aide]],VLOOKUP(Table1[[#This Row],[County Where Youth Resides]],'Drop Down'!K:M,3,0))),\"0\")","v":"Case Aid Not Allowed"},"No",0,0]
["Select","-","-","-","-","DD/MM/YYYY","DD/MM/YYYY","Select","Select",{"$f":"VLOOKUP(Table1[[#This Row],[DCYF Case Region]],'Drop Down'!$F$3:$G$9,2,0)","v":"Select"},"Select","Select","Select",{"$f":"IFERROR(IF(M179=\"No\",INDEX(IndexMatch!C:C,MATCH(1,(IndexMatch!A:A=VLOOKUP(H179,'Drop Down'!K:L,2,0))*(IndexMatch!B:B=L179),0)),\"Service Already Opened\"),\"N/A\")","v":"Service Already Opened"},0,{"$f":"IF(O179>VLOOKUP(L179,'Drop Down'!$A$3:$B$10,2,0),\"1\",\"0\")","v":"0"},0,{"$f":"SUM(Table1[[#This Row],[Case Aide Hours]],Table1[[#This Row],[Case Aide Travel Time]])","v":0},{"$f":"IFERROR(IF(OR(Table1[[#This Row],[Child Support Level]]=\"Support Services Lvl 1\", Table1[[#This Row],[Child Support Level]]=\"Support Services Lvl 2\",Table1[[#This Row],[Child Support Level]]=\"Select\"),\"Case Aid Not Allowed\", PRODUCT(Table1[[#This Row],[Total Case Aide]],VLOOKUP(Table1[[#This Row],[County Where Youth Resides]],'Drop Down'!K:M,3,0))),\"0\")","v":"Case Aid Not Allowed"},"No",0,0]
["Select","-","-","-","-","DD/MM/YYYY","DD/MM/YYYY","Select","Select",{"$f":"VLOOKUP(Table1[[#This Row],[DCYF Case Region]],'Drop Down'!$F$3:$G$9,2,0)","v":"Select"},"Select","Select","Select",{"$f":"IFERROR(IF(M180=\"No\",INDEX(IndexMatch!C:C,MATCH(1,(IndexMatch!A:A=VLOOKUP(H180,'Drop Down'!K:L,2,0))*(IndexMatch!B:B=L180),0)),\"Service Already Opened\"),\"N/A\")","v":"Service Already Opened"},0,{"$f":"IF(O180>VLOOKUP(L180,'Drop Down'!$A$3:$B$10,2,0),\"1\",\"0\")","v":"0"},0,{"$f":"SUM(Table1[[#This Row],[Case Aide Hours]],Table1[[#This Row],[Case Aide Travel Time]])","v":0},{"$f":"IFERROR(IF(OR(Table1[[#This Row],[Child Support Level]]=\"Support Services Lvl 1\", Table1[[#This Row],[Child Support Level]]=\"Support Services Lvl 2\",Table1[[#This Row],[Child Support Level]]=\"Select\"),\"Case Aid Not Allowed\", PRODUCT(Table1[[#This Row],[Total Case Aide]],VLOOKUP(Table1[[#This Row],[County Where Youth Resides]],'Drop Down'!K:M,3,0))),\"0\")","v":"Case Aid Not Allowed"},"No",0,0]
["Select","-","-","-","-","DD/MM/YYYY","DD/MM/YYYY","Select","Select",{"$f":"VLOOKUP(Table1[[#This Row],[DCYF Case Region]],'Drop Down'!$F$3:$G$9,2,0)","v":"Select"},"Select","Select","Select",{"$f":"IFERROR(IF(M181=\"No\",INDEX(IndexMatch!C:C,MATCH(1,(IndexMatch!A:A=VLOOKUP(H181,'Drop Down'!K:L,2,0))*(IndexMatch!B:B=L181),0)),\"Service Already Opened\"),\"N/A\")","v":"Service Already Opened"},0,{"$f":"IF(O181>VLOOKUP(L181,'Drop Down'!$A$3:$B$10,2,0),\"1\",\"0\")","v":"0"},0,{"$f":"SUM(Table1[[#This Row],[Case Aide Hours]],Table1[[#This Row],[Case Aide Travel Time]])","v":0},{"$f":"IFERROR(IF(OR(Table1[[#This Row],[Child Support Level]]=\"Support Services Lvl 1\", Table1[[#This Row],[Child Support Level]]=\"Support Services Lvl 2\",Table1[[#This Row],[Child Support Level]]=\"Select\"),\"Case Aid Not Allowed\", PRODUCT(Table1[[#This Row],[Total Case Aide]],VLOOKUP(Table1[[#This Row],[County Where Youth Resides]],'Drop Down'!K:M,3,0))),\"0\")","v":"Case Aid Not Allowed"},"No",0,0]
["Select","-","-","-","-","DD/MM/YYYY","DD/MM/YYYY","Select","Select",{"$f":"VLOOKUP(Table1[[#This Row],[DCYF Case Region]],'Drop Down'!$F$3:$G$9,2,0)","v":"Select"},"Select","Select","Select",{"$f":"IFERROR(IF(M182=\"No\",INDEX(IndexMatch!C:C,MATCH(1,(IndexMatch!A:A=VLOOKUP(H182,'Drop Down'!K:L,2,0))*(IndexMatch!B:B=L182),0)),\"Service Already Opened\"),\"N/A\")","v":"Service Already Opened"},0,{"$f":"IF(O182>VLOOKUP(L182,'Drop Down'!$A$3:$B$10,2,0),\"1\",\"0\")","v":"0"},0,{"$f":"SUM(Table1[[#This Row],[Case Aide Hours]],Table1[[#This Row],[Case Aide Travel Time]])","v":0},{"$f":"IFERROR(IF(OR(Table1[[#This Row],[Child Support Level]]=\"Support Services Lvl 1\", Table1[[#This Row],[Child Support Level]]=\"Support Services Lvl 2\",Table1[[#This Row],[Child Support Level]]=\"Select\"),\"Case Aid Not Allowed\", PRODUCT(Table1[[#This Row],[Total Case Aide]],VLOOKUP(Table1[[#This Row],[County Where Youth Resides]],'Drop Down'!K:M,3,0))),\"0\")","v":"Case Aid Not Allowed"},"No",0,0]
["Select","-","-","-","-","DD/MM/YYYY","DD/MM/YYYY","Select","Select",{"$f":"VLOOKUP(Table1[[#This Row],[DCYF Case Region]],'Drop Down'!$F$3:$G$9,2,0)","v":"Select"},"Select","Select","Select",{"$f":"IFERROR(IF(M183=\"No\",INDEX(IndexMatch!C:C,MATCH(1,(IndexMatch!A:A=VLOOKUP(H183,'Drop Down'!K:L,2,0))*(IndexMatch!B:B=L183),0)),\"Service Already Opened\"),\"N/A\")","v":"Service Already Opened"},0,{"$f":"IF(O183>VLOOKUP(L183,'Drop Down'!$A$3:$B$10,2,0),\"1\",\"0\")","v":"0"},0,{"$f":"SUM(Table1[[#This Row],[Case Aide Hours]],Table1[[#This Row],[Case Aide Travel Time]])","v":0},{"$f":"IFERROR(IF(OR(Table1[[#This Row],[Child Support Level]]=\"Support Services Lvl 1\", Table1[[#This Row],[Child Support Level]]=\"Support Services Lvl 2\",Table1[[#This Row],[Child Support Level]]=\"Select\"),\"Case Aid Not Allowed\", PRODUCT(Table1[[#This Row],[Total Case Aide]],VLOOKUP(Table1[[#This Row],[County Where Youth Resides]],'Drop Down'!K:M,3,0))),\"0\")","v":"Case Aid Not Allowed"},"No",0,0]
["Select","-","-","-","-","DD/MM/YYYY","DD/MM/YYYY","Select","Select",{"$f":"VLOOKUP(Table1[[#This Row],[DCYF Case Region]],'Drop Down'!$F$3:$G$9,2,0)","v":"Select"},"Select","Select","Select",{"$f":"IFERROR(IF(M184=\"No\",INDEX(IndexMatch!C:C,MATCH(1,(IndexMatch!A:A=VLOOKUP(H184,'Drop Down'!K:L,2,0))*(IndexMatch!B:B=L184),0)),\"Service Already Opened\"),\"N/A\")","v":"Service Already Opened"},0,{"$f":"IF(O184>VLOOKUP(L184,'Drop Down'!$A$3:$B$10,2,0),\"1\",\"0\")","v":"0"},0,{"$f":"SUM(Table1[[#This Row],[Case Aide Hours]],Table1[[#This Row],[Case Aide Travel Time]])","v":0},{"$f":"IFERROR(IF(OR(Table1[[#This Row],[Child Support Level]]=\"Support Services Lvl 1\", Table1[[#This Row],[Child Support Level]]=\"Support Services Lvl 2\",Table1[[#This Row],[Child Support Level]]=\"Select\"),\"Case Aid Not Allowed\", PRODUCT(Table1[[#This Row],[Total Case Aide]],VLOOKUP(Table1[[#This Row],[County Where Youth Resides]],'Drop Down'!K:M,3,0))),\"0\")","v":"Case Aid Not Allowed"},"No",0,0]
["Select","-","-","-","-","DD/MM/YYYY","DD/MM/YYYY","Select","Select",{"$f":"VLOOKUP(Table1[[#This Row],[DCYF Case Region]],'Drop Down'!$F$3:$G$9,2,0)","v":"Select"},"Select","Select","Select",{"$f":"IFERROR(IF(M185=\"No\",INDEX(IndexMatch!C:C,MATCH(1,(IndexMatch!A:A=VLOOKUP(H185,'Drop Down'!K:L,2,0))*(IndexMatch!B:B=L185),0)),\"Service Already Opened\"),\"N/A\")","v":"Service Already Opened"},0,{"$f":"IF(O185>VLOOKUP(L185,'Drop Down'!$A$3:$B$10,2,0),\"1\",\"0\")","v":"0"},0,{"$f":"SUM(Table1[[#This Row],[Case Aide Hours]],Table1[[#This Row],[Case Aide Travel Time]])","v":0},{"$f":"IFERROR(IF(OR(Table1[[#This Row],[Child Support Level]]=\"Support Services Lvl 1\", Table1[[#This Row],[Child Support Level]]=\"Support Services Lvl 2\",Table1[[#This Row],[Child Support Level]]=\"Select\"),\"Case Aid Not Allowed\", PRODUCT(Table1[[#This Row],[Total Case Aide]],VLOOKUP(Table1[[#This Row],[County Where Youth Resides]],'Drop Down'!K:M,3,0))),\"0\")","v":"Case Aid Not Allowed"},"No",0,0]
["Select","-","-","-","-","DD/MM/YYYY","DD/MM/YYYY","Select","Select",{"$f":"VLOOKUP(Table1[[#This Row],[DCYF Case Region]],'Drop Down'!$F$3:$G$9,2,0)","v":"Select"},"Select","Select","Select",{"$f":"IFERROR(IF(M186=\"No\",INDEX(IndexMatch!C:C,MATCH(1,(IndexMatch!A:A=VLOOKUP(H186,'Drop Down'!K:L,2,0))*(IndexMatch!B:B=L186),0)),\"Service Already Opened\"),\"N/A\")","v":"Service Already Opened"},0,{"$f":"IF(O186>VLOOKUP(L186,'Drop Down'!$A$3:$B$10,2,0),\"1\",\"0\")","v":"0"},0,{"$f":"SUM(Table1[[#This Row],[Case Aide Hours]],Table1[[#This Row],[Case Aide Travel Time]])","v":0},{"$f":"IFERROR(IF(OR(Table1[[#This Row],[Child Support Level]]=\"Support Services Lvl 1\", Table1[[#This Row],[Child Support Level]]=\"Support Services Lvl 2\",Table1[[#This Row],[Child Support Level]]=\"Select\"),\"Case Aid Not Allowed\", PRODUCT(Table1[[#This Row],[Total Case Aide]],VLOOKUP(Table1[[#This Row],[County Where Youth Resides]],'Drop Down'!K:M,3,0))),\"0\")","v":"Case Aid Not Allowed"},"No",0,0]
["Select","-","-","-","-","DD/MM/YYYY","DD/MM/YYYY","Select","Select",{"$f":"VLOOKUP(Table1[[#This Row],[DCYF Case Region]],'Drop Down'!$F$3:$G$9,2,0)","v":"Select"},"Select","Select","Select",{"$f":"IFERROR(IF(M187=\"No\",INDEX(IndexMatch!C:C,MATCH(1,(IndexMatch!A:A=VLOOKUP(H187,'Drop Down'!K:L,2,0))*(IndexMatch!B:B=L187),0)),\"Service Already Opened\"),\"N/A\")","v":"Service Already Opened"},0,{"$f":"IF(O187>VLOOKUP(L187,'Drop Down'!$A$3:$B$10,2,0),\"1\",\"0\")","v":"0"},0,{"$f":"SUM(Table1[[#This Row],[Case Aide Hours]],Table1[[#This Row],[Case Aide Travel Time]])","v":0},{"$f":"IFERROR(IF(OR(Table1[[#This Row],[Child Support Level]]=\"Support Services Lvl 1\", Table1[[#This Row],[Child Support Level]]=\"Support Services Lvl 2\",Table1[[#This Row],[Child Support Level]]=\"Select\"),\"Case Aid Not Allowed\", PRODUCT(Table1[[#This Row],[Total Case Aide]],VLOOKUP(Table1[[#This Row],[County Where Youth Resides]],'Drop Down'!K:M,3,0))),\"0\")","v":"Case Aid Not Allowed"},"No",0,0]
["Select","-","-","-","-","DD/MM/YYYY","DD/MM/YYYY","Select","Select",{"$f":"VLOOKUP(Table1[[#This Row],[DCYF Case Region]],'Drop Down'!$F$3:$G$9,2,0)","v":"Select"},"Select","Select","Select",{"$f":"IFERROR(IF(M188=\"No\",INDEX(IndexMatch!C:C,MATCH(1,(IndexMatch!A:A=VLOOKUP(H188,'Drop Down'!K:L,2,0))*(IndexMatch!B:B=L188),0)),\"Service Already Opened\"),\"N/A\")","v":"Service Already Opened"},0,{"$f":"IF(O188>VLOOKUP(L188,'Drop Down'!$A$3:$B$10,2,0),\"1\",\"0\")","v":"0"},0,{"$f":"SUM(Table1[[#This Row],[Case Aide Hours]],Table1[[#This Row],[Case Aide Travel Time]])","v":0},{"$f":"IFERROR(IF(OR(Table1[[#This Row],[Child Support Level]]=\"Support Services Lvl 1\", Table1[[#This Row],[Child Support Level]]=\"Support Services Lvl 2\",Table1[[#This Row],[Child Support Level]]=\"Select\"),\"Case Aid Not Allowed\", PRODUCT(Table1[[#This Row],[Total Case Aide]],VLOOKUP(Table1[[#This Row],[County Where Youth Resides]],'Drop Down'!K:M,3,0))),\"0\")","v":"Case Aid Not Allowed"},"No",0,0]
["Select","-","-","-","-","DD/MM/YYYY","DD/MM/YYYY","Select","Select",{"$f":"VLOOKUP(Table1[[#This Row],[DCYF Case Region]],'Drop Down'!$F$3:$G$9,2,0)","v":"Select"},"Select","Select","Select",{"$f":"IFERROR(IF(M189=\"No\",INDEX(IndexMatch!C:C,MATCH(1,(IndexMatch!A:A=VLOOKUP(H189,'Drop Down'!K:L,2,0))*(IndexMatch!B:B=L189),0)),\"Service Already Opened\"),\"N/A\")","v":"Service Already Opened"},0,{"$f":"IF(O189>VLOOKUP(L189,'Drop Down'!$A$3:$B$10,2,0),\"1\",\"0\")","v":"0"},0,{"$f":"SUM(Table1[[#This Row],[Case Aide Hours]],Table1[[#This Row],[Case Aide Travel Time]])","v":0},{"$f":"IFERROR(IF(OR(Table1[[#This Row],[Child Support Level]]=\"Support Services Lvl 1\", Table1[[#This Row],[Child Support Level]]=\"Support Services Lvl 2\",Table1[[#This Row],[Child Support Level]]=\"Select\"),\"Case Aid Not Allowed\", PRODUCT(Table1[[#This Row],[Total Case Aide]],VLOOKUP(Table1[[#This Row],[County Where Youth Resides]],'Drop Down'!K:M,3,0))),\"0\")","v":"Case Aid Not Allowed"},"No",0,0]
["Select","-","-","-","-","DD/MM/YYYY","DD/MM/YYYY","Select","Select",{"$f":"VLOOKUP(Table1[[#This Row],[DCYF Case Region]],'Drop Down'!$F$3:$G$9,2,0)","v":"Select"},"Select","Select","Select",{"$f":"IFERROR(IF(M190=\"No\",INDEX(IndexMatch!C:C,MATCH(1,(IndexMatch!A:A=VLOOKUP(H190,'Drop Down'!K:L,2,0))*(IndexMatch!B:B=L190),0)),\"Service Already Opened\"),\"N/A\")","v":"Service Already Opened"},0,{"$f":"IF(O190>VLOOKUP(L190,'Drop Down'!$A$3:$B$10,2,0),\"1\",\"0\")","v":"0"},0,{"$f":"SUM(Table1[[#This Row],[Case Aide Hours]],Table1[[#This Row],[Case Aide Travel Time]])","v":0},{"$f":"IFERROR(IF(OR(Table1[[#This Row],[Child Support Level]]=\"Support Services Lvl 1\", Table1[[#This Row],[Child Support Level]]=\"Support Services Lvl 2\",Table1[[#This Row],[Child Support Level]]=\"Select\"),\"Case Aid Not Allowed\", PRODUCT(Table1[[#This Row],[Total Case Aide]],VLOOKUP(Table1[[#This Row],[County Where Youth Resides]],'Drop Down'!K:M,3,0))),\"0\")","v":"Case Aid Not Allowed"},"No",0,0]
["Select","-","-","-","-","DD/MM/YYYY","DD/MM/YYYY","Select","Select",{"$f":"VLOOKUP(Table1[[#This Row],[DCYF Case Region]],'Drop Down'!$F$3:$G$9,2,0)","v":"Select"},"Select","Select","Select",{"$f":"IFERROR(IF(M191=\"No\",INDEX(IndexMatch!C:C,MATCH(1,(IndexMatch!A:A=VLOOKUP(H191,'Drop Down'!K:L,2,0))*(IndexMatch!B:B=L191),0)),\"Service Already Opened\"),\"N/A\")","v":"Service Already Opened"},0,{"$f":"IF(O191>VLOOKUP(L191,'Drop Down'!$A$3:$B$10,2,0),\"1\",\"0\")","v":"0"},0,{"$f":"SUM(Table1[[#This Row],[Case Aide Hours]],Table1[[#This Row],[Case Aide Travel Time]])","v":0},{"$f":"IFERROR(IF(OR(Table1[[#This Row],[Child Support Level]]=\"Support Services Lvl 1\", Table1[[#This Row],[Child Support Level]]=\"Support Services Lvl 2\",Table1[[#This Row],[Child Support Level]]=\"Select\"),\"Case Aid Not Allowed\", PRODUCT(Table1[[#This Row],[Total Case Aide]],VLOOKUP(Table1[[#This Row],[County Where Youth Resides]],'Drop Down'!K:M,3,0))),\"0\")","v":"Case Aid Not Allowed"},"No",0,0]
["Select","-","-","-","-","DD/MM/YYYY","DD/MM/YYYY","Select","Select",{"$f":"VLOOKUP(Table1[[#This Row],[DCYF Case Region]],'Drop Down'!$F$3:$G$9,2,0)","v":"Select"},"Select","Select","Select",{"$f":"IFERROR(IF(M192=\"No\",INDEX(IndexMatch!C:C,MATCH(1,(IndexMatch!A:A=VLOOKUP(H192,'Drop Down'!K:L,2,0))*(IndexMatch!B:B=L192),0)),\"Service Already Opened\"),\"N/A\")","v":"Service Already Opened"},0,{"$f":"IF(O192>VLOOKUP(L192,'Drop Down'!$A$3:$B$10,2,0),\"1\",\"0\")","v":"0"},0,{"$f":"SUM(Table1[[#This Row],[Case Aide Hours]],Table1[[#This Row],[Case Aide Travel Time]])","v":0},{"$f":"IFERROR(IF(OR(Table1[[#This Row],[Child Support Level]]=\"Support Services Lvl 1\", Table1[[#This Row],[Child Support Level]]=\"Support Services Lvl 2\",Table1[[#This Row],[Child Support Level]]=\"Select\"),\"Case Aid Not Allowed\", PRODUCT(Table1[[#This Row],[Total Case Aide]],VLOOKUP(Table1[[#This Row],[County Where Youth Resides]],'Drop Down'!K:M,3,0))),\"0\")","v":"Case Aid Not Allowed"},"No",0,0]
["Select","-","-","-","-","DD/MM/YYYY","DD/MM/YYYY","Select","Select",{"$f":"VLOOKUP(Table1[[#This Row],[DCYF Case Region]],'Drop Down'!$F$3:$G$9,2,0)","v":"Select"},"Select","Select","Select",{"$f":"IFERROR(IF(M193=\"No\",INDEX(IndexMatch!C:C,MATCH(1,(IndexMatch!A:A=VLOOKUP(H193,'Drop Down'!K:L,2,0))*(IndexMatch!B:B=L193),0)),\"Service Already Opened\"),\"N/A\")","v":"Service Already Opened"},0,{"$f":"IF(O193>VLOOKUP(L193,'Drop Down'!$A$3:$B$10,2,0),\"1\",\"0\")","v":"0"},0,{"$f":"SUM(Table1[[#This Row],[Case Aide Hours]],Table1[[#This Row],[Case Aide Travel Time]])","v":0},{"$f":"IFERROR(IF(OR(Table1[[#This Row],[Child Support Level]]=\"Support Services Lvl 1\", Table1[[#This Row],[Child Support Level]]=\"Support Services Lvl 2\",Table1[[#This Row],[Child Support Level]]=\"Select\"),\"Case Aid Not Allowed\", PRODUCT(Table1[[#This Row],[Total Case Aide]],VLOOKUP(Table1[[#This Row],[County Where Youth Resides]],'Drop Down'!K:M,3,0))),\"0\")","v":"Case Aid Not Allowed"},"No",0,0]
["Select","-","-","-","-","DD/MM/YYYY","DD/MM/YYYY","Select","Select",{"$f":"VLOOKUP(Table1[[#This Row],[DCYF Case Region]],'Drop Down'!$F$3:$G$9,2,0)","v":"Select"},"Select","Select","Select",{"$f":"IFERROR(IF(M194=\"No\",INDEX(IndexMatch!C:C,MATCH(1,(IndexMatch!A:A=VLOOKUP(H194,'Drop Down'!K:L,2,0))*(IndexMatch!B:B=L194),0)),\"Service Already Opened\"),\"N/A\")","v":"Service Already Opened"},0,{"$f":"IF(O194>VLOOKUP(L194,'Drop Down'!$A$3:$B$10,2,0),\"1\",\"0\")","v":"0"},0,{"$f":"SUM(Table1[[#This Row],[Case Aide Hours]],Table1[[#This Row],[Case Aide Travel Time]])","v":0},{"$f":"IFERROR(IF(OR(Table1[[#This Row],[Child Support Level]]=\"Support Services Lvl 1\", Table1[[#This Row],[Child Support Level]]=\"Support Services Lvl 2\",Table1[[#This Row],[Child Support Level]]=\"Select\"),\"Case Aid Not Allowed\", PRODUCT(Table1[[#This Row],[Total Case Aide]],VLOOKUP(Table1[[#This Row],[County Where Youth Resides]],'Drop Down'!K:M,3,0))),\"0\")","v":"Case Aid Not Allowed"},"No",0,{"$f":"ROUND(PRODUCT(U194,0.67),2)","v":0}]
["Select","-","-","-","-","DD/MM/YYYY","DD/MM/YYYY","Select","Select",{"$f":"VLOOKUP(Table1[[#This Row],[DCYF Case Region]],'Drop Down'!$F$3:$G$9,2,0)","v":"Select"},"Select","Select","Select",{"$f":"IFERROR(IF(M195=\"No\",INDEX(IndexMatch!C:C,MATCH(1,(IndexMatch!A:A=VLOOKUP(H195,'Drop Down'!K:L,2,0))*(IndexMatch!B:B=L195),0)),\"Service Already Opened\"),\"N/A\")","v":"Service Already Opened"},0,{"$f":"IF(O195>VLOOKUP(L195,'Drop Down'!$A$3:$B$10,2,0),\"1\",\"0\")","v":"0"},0,{"$f":"SUM(Table1[[#This Row],[Case Aide Hours]],Table1[[#This Row],[Case Aide Travel Time]])","v":0},{"$f":"IFERROR(IF(OR(Table1[[#This Row],[Child Support Level]]=\"Support Services Lvl 1\", Table1[[#This Row],[Child Support Level]]=\"Support Services Lvl 2\",Table1[[#This Row],[Child Support Level]]=\"Select\"),\"Case Aid Not Allowed\", PRODUCT(Table1[[#This Row],[Total Case Aide]],VLOOKUP(Table1[[#This Row],[County Where Youth Resides]],'Drop Down'!K:M,3,0))),\"0\")","v":"Case Aid Not Allowed"},{"$f":"IF(P195=\"1\",\"Yes\",\"No\")","v":"No"},0,0]
["Select","-","-","-","-","DD/MM/YYYY","DD/MM/YYYY","Select","Select",{"$f":"VLOOKUP(Table1[[#This Row],[DCYF Case Region]],'Drop Down'!$F$3:$G$9,2,0)","v":"Select"},"Select","Select","Select",{"$f":"IFERROR(IF(M196=\"No\",INDEX(IndexMatch!C:C,MATCH(1,(IndexMatch!A:A=VLOOKUP(H196,'Drop Down'!K:L,2,0))*(IndexMatch!B:B=L196),0)),\"Service Already Opened\"),\"N/A\")","v":"Service Already Opened"},0,{"$f":"IF(O196>VLOOKUP(L196,'Drop Down'!$A$3:$B$10,2,0),\"1\",\"0\")","v":"0"},0,{"$f":"SUM(Table1[[#This Row],[Case Aide Hours]],Table1[[#This Row],[Case Aide Travel Time]])","v":0},{"$f":"IFERROR(IF(OR(Table1[[#This Row],[Child Support Level]]=\"Support Services Lvl 1\", Table1[[#This Row],[Child Support Level]]=\"Support Services Lvl 2\",Table1[[#This Row],[Child Support Level]]=\"Select\"),\"Case Aid Not Allowed\", PRODUCT(Table1[[#This Row],[Total Case Aide]],VLOOKUP(Table1[[#This Row],[County Where Youth Resides]],'Drop Down'!K:M,3,0))),\"0\")","v":"Case Aid Not Allowed"},"No",0,0]
["Select","-","-","-","-","DD/MM/YYYY","DD/MM/YYYY","Select","Select",{"$f":"VLOOKUP(Table1[[#This Row],[DCYF Case Region]],'Drop Down'!$F$3:$G$9,2,0)","v":"Select"},"Select","Select","Select",{"$f":"IFERROR(IF(M197=\"No\",INDEX(IndexMatch!C:C,MATCH(1,(IndexMatch!A:A=VLOOKUP(H197,'Drop Down'!K:L,2,0))*(IndexMatch!B:B=L197),0)),\"Service Already Opened\"),\"N/A\")","v":"Service Already Opened"},0,{"$f":"IF(O197>VLOOKUP(L197,'Drop Down'!$A$3:$B$10,2,0),\"1\",\"0\")","v":"0"},0,{"$f":"SUM(Table1[[#This Row],[Case Aide Hours]],Table1[[#This Row],[Case Aide Travel Time]])","v":0},{"$f":"IFERROR(IF(OR(Table1[[#This Row],[Child Support Level]]=\"Support Services Lvl 1\", Table1[[#This Row],[Child Support Level]]=\"Support Services Lvl 2\",Table1[[#This Row],[Child Support Level]]=\"Select\"),\"Case Aid Not Allowed\", PRODUCT(Table1[[#This Row],[Total Case Aide]],VLOOKUP(Table1[[#This Row],[County Where Youth Resides]],'Drop Down'!K:M,3,0))),\"0\")","v":"Case Aid Not Allowed"},"No",0,0]
["Select","-","-","-","-","DD/MM/YYYY","DD/MM/YYYY","Select","Select",{"$f":"VLOOKUP(Table1[[#This Row],[DCYF Case Region]],'Drop Down'!$F$3:$G$9,2,0)","v":"Select"},"Select","Select","Select",{"$f":"IFERROR(IF(M198=\"No\",INDEX(IndexMatch!C:C,MATCH(1,(IndexMatch!A:A=VLOOKUP(H198,'Drop Down'!K:L,2,0))*(IndexMatch!B:B=L198),0)),\"Service Already Opened\"),\"N/A\")","v":"Service Already Opened"},0,{"$f":"IF(O198>VLOOKUP(L198,'Drop Down'!$A$3:$B$10,2,0),\"1\",\"0\")","v":"0"},0,{"$f":"SUM(Table1[[#This Row],[Case Aide Hours]],Table1[[#This Row],[Case Aide Travel Time]])","v":0},{"$f":"IFERROR(IF(OR(Table1[[#This Row],[Child Support Level]]=\"Support Services Lvl 1\", Table1[[#This Row],[Child Support Level]]=\"Support Services Lvl 2\",Table1[[#This Row],[Child Support Level]]=\"Select\"),\"Case Aid Not Allowed\", PRODUCT(Table1[[#This Row],[Total Case Aide]],VLOOKUP(Table1[[#This Row],[County Where Youth Resides]],'Drop Down'!K:M,3,0))),\"0\")","v":"Case Aid Not Allowed"},"No",0,0]
["Select","-","-","-","-","DD/MM/YYYY","DD/MM/YYYY","Select","Select",{"$f":"VLOOKUP(Table1[[#This Row],[DCYF Case Region]],'Drop Down'!$F$3:$G$9,2,0)","v":"Select"},"Select","Select","Select",{"$f":"IFERROR(IF(M199=\"No\",INDEX(IndexMatch!C:C,MATCH(1,(IndexMatch!A:A=VLOOKUP(H199,'Drop Down'!K:L,2,0))*(IndexMatch!B:B=L199),0)),\"Service Already Opened\"),\"N/A\")","v":"Service Already Opened"},0,{"$f":"IF(O199>VLOOKUP(L199,'Drop Down'!$A$3:$B$10,2,0),\"1\",\"0\")","v":"0"},0,{"$f":"SUM(Table1[[#This Row],[Case Aide Hours]],Table1[[#This Row],[Case Aide Travel Time]])","v":0},{"$f":"IFERROR(IF(OR(Table1[[#This Row],[Child Support Level]]=\"Support Services Lvl 1\", Table1[[#This Row],[Child Support Level]]=\"Support Services Lvl 2\",Table1[[#This Row],[Child Support Level]]=\"Select\"),\"Case Aid Not Allowed\", PRODUCT(Table1[[#This Row],[Total Case Aide]],VLOOKUP(Table1[[#This Row],[County Where Youth Resides]],'Drop Down'!K:M,3,0))),\"0\")","v":"Case Aid Not Allowed"},"No",0,0]
["Select","-","-","-","-","DD/MM/YYYY","DD/MM/YYYY","Select","Select",{"$f":"VLOOKUP(Table1[[#This Row],[DCYF Case Region]],'Drop Down'!$F$3:$G$9,2,0)","v":"Select"},"Select","Select","Select",{"$f":"IFERROR(IF(M200=\"No\",INDEX(IndexMatch!C:C,MATCH(1,(IndexMatch!A:A=VLOOKUP(H200,'Drop Down'!K:L,2,0))*(IndexMatch!B:B=L200),0)),\"Service Already Opened\"),\"N/A\")","v":"Service Already Opened"},0,{"$f":"IF(O200>VLOOKUP(L200,'Drop Down'!$A$3:$B$10,2,0),\"1\",\"0\")","v":"0"},0,{"$f":"SUM(Table1[[#This Row],[Case Aide Hours]],Table1[[#This Row],[Case Aide Travel Time]])","v":0},{"$f":"IFERROR(IF(OR(Table1[[#This Row],[Child Support Level]]=\"Support Services Lvl 1\", Table1[[#This Row],[Child Support Level]]=\"Support Services Lvl 2\",Table1[[#This Row],[Child Support Level]]=\"Select\"),\"Case Aid Not Allowed\", PRODUCT(Table1[[#This Row],[Total Case Aide]],VLOOKUP(Table1[[#This Row],[County Where Youth Resides]],'Drop Down'!K:M,3,0))),\"0\")","v":"Case Aid Not Allowed"},"No",0,0]
["Select","-","-","-","-","DD/MM/YYYY","DD/MM/YYYY","Select","Select",{"$f":"VLOOKUP(Table1[[#This Row],[DCYF Case Region]],'Drop Down'!$F$3:$G$9,2,0)","v":"Select"},"Select","Select","Select",{"$f":"IFERROR(IF(M201=\"No\",INDEX(IndexMatch!C:C,MATCH(1,(IndexMatch!A:A=VLOOKUP(H201,'Drop Down'!K:L,2,0))*(IndexMatch!B:B=L201),0)),\"Service Already Opened\"),\"N/A\")","v":"Service Already Opened"},0,{"$f":"IF(O201>VLOOKUP(L201,'Drop Down'!$A$3:$B$10,2,0),\"1\",\"0\")","v":"0"},0,{"$f":"SUM(Table1[[#This Row],[Case Aide Hours]],Table1[[#This Row],[Case Aide Travel Time]])","v":0},{"$f":"IFERROR(IF(OR(Table1[[#This Row],[Child Support Level]]=\"Support Services Lvl 1\", Table1[[#This Row],[Child Support Level]]=\"Support Services Lvl 2\",Table1[[#This Row],[Child Support Level]]=\"Select\"),\"Case Aid Not Allowed\", PRODUCT(Table1[[#This Row],[Total Case Aide]],VLOOKUP(Table1[[#This Row],[County Where Youth Resides]],'Drop Down'!K:M,3,0))),\"0\")","v":"Case Aid Not Allowed"},"No",0,0]
["Select","-","-","-","-","DD/MM/YYYY","DD/MM/YYYY","Select","Select",{"$f":"VLOOKUP(Table1[[#This Row],[DCYF Case Region]],'Drop Down'!$F$3:$G$9,2,0)","v":"Select"},"Select","Select","Select",{"$f":"IFERROR(IF(M202=\"No\",INDEX(IndexMatch!C:C,MATCH(1,(IndexMatch!A:A=VLOOKUP(H202,'Drop Down'!K:L,2,0))*(IndexMatch!B:B=L202),0)),\"Service Already Opened\"),\"N/A\")","v":"Service Already Opened"},0,{"$f":"IF(O202>VLOOKUP(L202,'Drop Down'!$A$3:$B$10,2,0),\"1\",\"0\")","v":"0"},0,{"$f":"SUM(Table1[[#This Row],[Case Aide Hours]],Table1[[#This Row],[Case Aide Travel Time]])","v":0},{"$f":"IFERROR(IF(OR(Table1[[#This Row],[Child Support Level]]=\"Support Services Lvl 1\", Table1[[#This Row],[Child Support Level]]=\"Support Services Lvl 2\",Table1[[#This Row],[Child Support Level]]=\"Select\"),\"Case Aid Not Allowed\", PRODUCT(Table1[[#This Row],[Total Case Aide]],VLOOKUP(Table1[[#This Row],[County Where Youth Resides]],'Drop Down'!K:M,3,0))),\"0\")","v":"Case Aid Not Allowed"},"No",0,0]
["Select","-","-","-","-","DD/MM/YYYY","DD/MM/YYYY","Select","Select",{"$f":"VLOOKUP(Table1[[#This Row],[DCYF Case Region]],'Drop Down'!$F$3:$G$9,2,0)","v":"Select"},"Select","Select","Select",{"$f":"IFERROR(IF(M203=\"No\",INDEX(IndexMatch!C:C,MATCH(1,(IndexMatch!A:A=VLOOKUP(H203,'Drop Down'!K:L,2,0))*(IndexMatch!B:B=L203),0)),\"Service Already Opened\"),\"N/A\")","v":"Service Already Opened"},0,{"$f":"IF(O203>VLOOKUP(L203,'Drop Down'!$A$3:$B$10,2,0),\"1\",\"0\")","v":"0"},0,{"$f":"SUM(Table1[[#This Row],[Case Aide Hours]],Table1[[#This Row],[Case Aide Travel Time]])","v":0},{"$f":"IFERROR(IF(OR(Table1[[#This Row],[Child Support Level]]=\"Support Services Lvl 1\", Table1[[#This Row],[Child Support Level]]=\"Support Services Lvl 2\",Table1[[#This Row],[Child Support Level]]=\"Select\"),\"Case Aid Not Allowed\", PRODUCT(Table1[[#This Row],[Total Case Aide]],VLOOKUP(Table1[[#This Row],[County Where Youth Resides]],'Drop Down'!K:M,3,0))),\"0\")","v":"Case Aid Not Allowed"},"No",0,0]
["Select","-","-","-","-","DD/MM/YYYY","DD/MM/YYYY","Select","Select",{"$f":"VLOOKUP(Table1[[#This Row],[DCYF Case Region]],'Drop Down'!$F$3:$G$9,2,0)","v":"Select"},"Select","Select","Select",{"$f":"IFERROR(IF(M204=\"No\",INDEX(IndexMatch!C:C,MATCH(1,(IndexMatch!A:A=VLOOKUP(H204,'Drop Down'!K:L,2,0))*(IndexMatch!B:B=L204),0)),\"Service Already Opened\"),\"N/A\")","v":"Service Already Opened"},0,{"$f":"IF(O204>VLOOKUP(L204,'Drop Down'!$A$3:$B$10,2,0),\"1\",\"0\")","v":"0"},0,{"$f":"SUM(Table1[[#This Row],[Case Aide Hours]],Table1[[#This Row],[Case Aide Travel Time]])","v":0},{"$f":"IFERROR(IF(OR(Table1[[#This Row],[Child Support Level]]=\"Support Services Lvl 1\", Table1[[#This Row],[Child Support Level]]=\"Support Services Lvl 2\",Table1[[#This Row],[Child Support Level]]=\"Select\"),\"Case Aid Not Allowed\", PRODUCT(Table1[[#This Row],[Total Case Aide]],VLOOKUP(Table1[[#This Row],[County Where Youth Resides]],'Drop Down'!K:M,3,0))),\"0\")","v":"Case Aid Not Allowed"},"No",0,0]
["Select","-","-","-","-","DD/MM/YYYY","DD/MM/YYYY","Select","Select",{"$f":"VLOOKUP(Table1[[#This Row],[DCYF Case Region]],'Drop Down'!$F$3:$G$9,2,0)","v":"Select"},"Select","Select","Select",{"$f":"IFERROR(IF(M205=\"No\",INDEX(IndexMatch!C:C,MATCH(1,(IndexMatch!A:A=VLOOKUP(H205,'Drop Down'!K:L,2,0))*(IndexMatch!B:B=L205),0)),\"Service Already Opened\"),\"N/A\")","v":"Service Already Opened"},0,{"$f":"IF(O205>VLOOKUP(L205,'Drop Down'!$A$3:$B$10,2,0),\"1\",\"0\")","v":"0"},0,{"$f":"SUM(Table1[[#This Row],[Case Aide Hours]],Table1[[#This Row],[Case Aide Travel Time]])","v":0},{"$f":"IFERROR(IF(OR(Table1[[#This Row],[Child Support Level]]=\"Support Services Lvl 1\", Table1[[#This Row],[Child Support Level]]=\"Support Services Lvl 2\",Table1[[#This Row],[Child Support Level]]=\"Select\"),\"Case Aid Not Allowed\", PRODUCT(Table1[[#This Row],[Total Case Aide]],VLOOKUP(Table1[[#This Row],[County Where Youth Resides]],'Drop Down'!K:M,3,0))),\"0\")","v":"Case Aid Not Allowed"},"No",0,0]
["Select","-","-","-","-","DD/MM/YYYY","DD/MM/YYYY","Select","Select",{"$f":"VLOOKUP(Table1[[#This Row],[DCYF Case Region]],'Drop Down'!$F$3:$G$9,2,0)","v":"Select"},"Select","Select","Select",{"$f":"IFERROR(IF(M206=\"No\",INDEX(IndexMatch!C:C,MATCH(1,(IndexMatch!A:A=VLOOKUP(H206,'Drop Down'!K:L,2,0))*(IndexMatch!B:B=L206),0)),\"Service Already Opened\"),\"N/A\")","v":"Service Already Opened"},0,{"$f":"IF(O206>VLOOKUP(L206,'Drop Down'!$A$3:$B$10,2,0),\"1\",\"0\")","v":"0"},0,{"$f":"SUM(Table1[[#This Row],[Case Aide Hours]],Table1[[#This Row],[Case Aide Travel Time]])","v":0},{"$f":"IFERROR(IF(OR(Table1[[#This Row],[Child Support Level]]=\"Support Services Lvl 1\", Table1[[#This Row],[Child Support Level]]=\"Support Services Lvl 2\",Table1[[#This Row],[Child Support Level]]=\"Select\"),\"Case Aid Not Allowed\", PRODUCT(Table1[[#This Row],[Total Case Aide]],VLOOKUP(Table1[[#This Row],[County Where Youth Resides]],'Drop Down'!K:M,3,0))),\"0\")","v":"Case Aid Not Allowed"},"No",0,0]
["Select","-","-","-","-","DD/MM/YYYY","DD/MM/YYYY","Select","Select",{"$f":"VLOOKUP(Table1[[#This Row],[DCYF Case Region]],'Drop Down'!$F$3:$G$9,2,0)","v":"Select"},"Select","Select","Select",{"$f":"IFERROR(IF(M207=\"No\",INDEX(IndexMatch!C:C,MATCH(1,(IndexMatch!A:A=VLOOKUP(H207,'Drop Down'!K:L,2,0))*(IndexMatch!B:B=L207),0)),\"Service Already Opened\"),\"N/A\")","v":"Service Already Opened"},0,{"$f":"IF(O207>VLOOKUP(L207,'Drop Down'!$A$3:$B$10,2,0),\"1\",\"0\")","v":"0"},0,{"$f":"SUM(Table1[[#This Row],[Case Aide Hours]],Table1[[#This Row],[Case Aide Travel Time]])","v":0},{"$f":"IFERROR(IF(OR(Table1[[#This Row],[Child Support Level]]=\"Support Services Lvl 1\", Table1[[#This Row],[Child Support Level]]=\"Support Services Lvl 2\",Table1[[#This Row],[Child Support Level]]=\"Select\"),\"Case Aid Not Allowed\", PRODUCT(Table1[[#This Row],[Total Case Aide]],VLOOKUP(Table1[[#This Row],[County Where Youth Resides]],'Drop Down'!K:M,3,0))),\"0\")","v":"Case Aid Not Allowed"},"No",0,0]
["Select","-","-","-","-","DD/MM/YYYY","DD/MM/YYYY","Select","Select",{"$f":"VLOOKUP(Table1[[#This Row],[DCYF Case Region]],'Drop Down'!$F$3:$G$9,2,0)","v":"Select"},"Select","Select","Select",{"$f":"IFERROR(IF(M208=\"No\",INDEX(IndexMatch!C:C,MATCH(1,(IndexMatch!A:A=VLOOKUP(H208,'Drop Down'!K:L,2,0))*(IndexMatch!B:B=L208),0)),\"Service Already Opened\"),\"N/A\")","v":"Service Already Opened"},0,{"$f":"IF(O208>VLOOKUP(L208,'Drop Down'!$A$3:$B$10,2,0),\"1\",\"0\")","v":"0"},0,{"$f":"SUM(Table1[[#This Row],[Case Aide Hours]],Table1[[#This Row],[Case Aide Travel Time]])","v":0},{"$f":"IFERROR(IF(OR(Table1[[#This Row],[Child Support Level]]=\"Support Services Lvl 1\", Table1[[#This Row],[Child Support Level]]=\"Support Services Lvl 2\",Table1[[#This Row],[Child Support Level]]=\"Select\"),\"Case Aid Not Allowed\", PRODUCT(Table1[[#This Row],[Total Case Aide]],VLOOKUP(Table1[[#This Row],[County Where Youth Resides]],'Drop Down'!K:M,3,0))),\"0\")","v":"Case Aid Not Allowed"},"No",0,0]
["Select","-","-","-","-","DD/MM/YYYY","DD/MM/YYYY","Select","Select",{"$f":"VLOOKUP(Table1[[#This Row],[DCYF Case Region]],'Drop Down'!$F$3:$G$9,2,0)","v":"Select"},"Select","Select","Select",{"$f":"IFERROR(IF(M209=\"No\",INDEX(IndexMatch!C:C,MATCH(1,(IndexMatch!A:A=VLOOKUP(H209,'Drop Down'!K:L,2,0))*(IndexMatch!B:B=L209),0)),\"Service Already Opened\"),\"N/A\")","v":"Service Already Opened"},0,{"$f":"IF(O209>VLOOKUP(L209,'Drop Down'!$A$3:$B$10,2,0),\"1\",\"0\")","v":"0"},0,{"$f":"SUM(Table1[[#This Row],[Case Aide Hours]],Table1[[#This Row],[Case Aide Travel Time]])","v":0},{"$f":"IFERROR(IF(OR(Table1[[#This Row],[Child Support Level]]=\"Support Services Lvl 1\", Table1[[#This Row],[Child Support Level]]=\"Support Services Lvl 2\",Table1[[#This Row],[Child Support Level]]=\"Select\"),\"Case Aid Not Allowed\", PRODUCT(Table1[[#This Row],[Total Case Aide]],VLOOKUP(Table1[[#This Row],[County Where Youth Resides]],'Drop Down'!K:M,3,0))),\"0\")","v":"Case Aid Not Allowed"},"No",0,0]
["Select","-","-","-","-","DD/MM/YYYY","DD/MM/YYYY","Select","Select",{"$f":"VLOOKUP(Table1[[#This Row],[DCYF Case Region]],'Drop Down'!$F$3:$G$9,2,0)","v":"Select"},"Select","Select","Select",{"$f":"IFERROR(IF(M210=\"No\",INDEX(IndexMatch!C:C,MATCH(1,(IndexMatch!A:A=VLOOKUP(H210,'Drop Down'!K:L,2,0))*(IndexMatch!B:B=L210),0)),\"Service Already Opened\"),\"N/A\")","v":"Service Already Opened"},0,{"$f":"IF(O210>VLOOKUP(L210,'Drop Down'!$A$3:$B$10,2,0),\"1\",\"0\")","v":"0"},0,{"$f":"SUM(Table1[[#This Row],[Case Aide Hours]],Table1[[#This Row],[Case Aide Travel Time]])","v":0},{"$f":"IFERROR(IF(OR(Table1[[#This Row],[Child Support Level]]=\"Support Services Lvl 1\", Table1[[#This Row],[Child Support Level]]=\"Support Services Lvl 2\",Table1[[#This Row],[Child Support Level]]=\"Select\"),\"Case Aid Not Allowed\", PRODUCT(Table1[[#This Row],[Total Case Aide]],VLOOKUP(Table1[[#This Row],[County Where Youth Resides]],'Drop Down'!K:M,3,0))),\"0\")","v":"Case Aid Not Allowed"},"No",0,0]
["Select","-","-","-","-","DD/MM/YYYY","DD/MM/YYYY","Select","Select",{"$f":"VLOOKUP(Table1[[#This Row],[DCYF Case Region]],'Drop Down'!$F$3:$G$9,2,0)","v":"Select"},"Select","Select","Select",{"$f":"IFERROR(IF(M211=\"No\",INDEX(IndexMatch!C:C,MATCH(1,(IndexMatch!A:A=VLOOKUP(H211,'Drop Down'!K:L,2,0))*(IndexMatch!B:B=L211),0)),\"Service Already Opened\"),\"N/A\")","v":"Service Already Opened"},0,{"$f":"IF(O211>VLOOKUP(L211,'Drop Down'!$A$3:$B$10,2,0),\"1\",\"0\")","v":"0"},0,{"$f":"SUM(Table1[[#This Row],[Case Aide Hours]],Table1[[#This Row],[Case Aide Travel Time]])","v":0},{"$f":"IFERROR(IF(OR(Table1[[#This Row],[Child Support Level]]=\"Support Services Lvl 1\", Table1[[#This Row],[Child Support Level]]=\"Support Services Lvl 2\",Table1[[#This Row],[Child Support Level]]=\"Select\"),\"Case Aid Not Allowed\", PRODUCT(Table1[[#This Row],[Total Case Aide]],VLOOKUP(Table1[[#This Row],[County Where Youth Resides]],'Drop Down'!K:M,3,0))),\"0\")","v":"Case Aid Not Allowed"},"No",0,0]
["Select","-","-","-","-","DD/MM/YYYY","DD/MM/YYYY","Select","Select",{"$f":"VLOOKUP(Table1[[#This Row],[DCYF Case Region]],'Drop Down'!$F$3:$G$9,2,0)","v":"Select"},"Select","Select","Select",{"$f":"IFERROR(IF(M212=\"No\",INDEX(IndexMatch!C:C,MATCH(1,(IndexMatch!A:A=VLOOKUP(H212,'Drop Down'!K:L,2,0))*(IndexMatch!B:B=L212),0)),\"Service Already Opened\"),\"N/A\")","v":"Service Already Opened"},0,{"$f":"IF(O212>VLOOKUP(L212,'Drop Down'!$A$3:$B$10,2,0),\"1\",\"0\")","v":"0"},0,{"$f":"SUM(Table1[[#This Row],[Case Aide Hours]],Table1[[#This Row],[Case Aide Travel Time]])","v":0},{"$f":"IFERROR(IF(OR(Table1[[#This Row],[Child Support Level]]=\"Support Services Lvl 1\", Table1[[#This Row],[Child Support Level]]=\"Support Services Lvl 2\",Table1[[#This Row],[Child Support Level]]=\"Select\"),\"Case Aid Not Allowed\", PRODUCT(Table1[[#This Row],[Total Case Aide]],VLOOKUP(Table1[[#This Row],[County Where Youth Resides]],'Drop Down'!K:M,3,0))),\"0\")","v":"Case Aid Not Allowed"},"No",0,0]
["Select","-","-","-","-","DD/MM/YYYY","DD/MM/YYYY","Select","Select",{"$f":"VLOOKUP(Table1[[#This Row],[DCYF Case Region]],'Drop Down'!$F$3:$G$9,2,0)","v":"Select"},"Select","Select","Select",{"$f":"IFERROR(IF(M213=\"No\",INDEX(IndexMatch!C:C,MATCH(1,(IndexMatch!A:A=VLOOKUP(H213,'Drop Down'!K:L,2,0))*(IndexMatch!B:B=L213),0)),\"Service Already Opened\"),\"N/A\")","v":"Service Already Opened"},0,{"$f":"IF(O213>VLOOKUP(L213,'Drop Down'!$A$3:$B$10,2,0),\"1\",\"0\")","v":"0"},0,{"$f":"SUM(Table1[[#This Row],[Case Aide Hours]],Table1[[#This Row],[Case Aide Travel Time]])","v":0},{"$f":"IFERROR(IF(OR(Table1[[#This Row],[Child Support Level]]=\"Support Services Lvl 1\", Table1[[#This Row],[Child Support Level]]=\"Support Services Lvl 2\",Table1[[#This Row],[Child Support Level]]=\"Select\"),\"Case Aid Not Allowed\", PRODUCT(Table1[[#This Row],[Total Case Aide]],VLOOKUP(Table1[[#This Row],[County Where Youth Resides]],'Drop Down'!K:M,3,0))),\"0\")","v":"Case Aid Not Allowed"},"No",0,0]
["Select","-","-","-","-","DD/MM/YYYY","DD/MM/YYYY","Select","Select",{"$f":"VLOOKUP(Table1[[#This Row],[DCYF Case Region]],'Drop Down'!$F$3:$G$9,2,0)","v":"Select"},"Select","Select","Select",{"$f":"IFERROR(IF(M214=\"No\",INDEX(IndexMatch!C:C,MATCH(1,(IndexMatch!A:A=VLOOKUP(H214,'Drop Down'!K:L,2,0))*(IndexMatch!B:B=L214),0)),\"Service Already Opened\"),\"N/A\")","v":"Service Already Opened"},0,{"$f":"IF(O214>VLOOKUP(L214,'Drop Down'!$A$3:$B$10,2,0),\"1\",\"0\")","v":"0"},0,{"$f":"SUM(Table1[[#This Row],[Case Aide Hours]],Table1[[#This Row],[Case Aide Travel Time]])","v":0},{"$f":"IFERROR(IF(OR(Table1[[#This Row],[Child Support Level]]=\"Support Services Lvl 1\", Table1[[#This Row],[Child Support Level]]=\"Support Services Lvl 2\",Table1[[#This Row],[Child Support Level]]=\"Select\"),\"Case Aid Not Allowed\", PRODUCT(Table1[[#This Row],[Total Case Aide]],VLOOKUP(Table1[[#This Row],[County Where Youth Resides]],'Drop Down'!K:M,3,0))),\"0\")","v":"Case Aid Not Allowed"},"No",0,0]
["Select","-","-","-","-","DD/MM/YYYY","DD/MM/YYYY","Select","Select",{"$f":"VLOOKUP(Table1[[#This Row],[DCYF Case Region]],'Drop Down'!$F$3:$G$9,2,0)","v":"Select"},"Select","Select","Select",{"$f":"IFERROR(IF(M215=\"No\",INDEX(IndexMatch!C:C,MATCH(1,(IndexMatch!A:A=VLOOKUP(H215,'Drop Down'!K:L,2,0))*(IndexMatch!B:B=L215),0)),\"Service Already Opened\"),\"N/A\")","v":"Service Already Opened"},0,{"$f":"IF(O215>VLOOKUP(L215,'Drop Down'!$A$3:$B$10,2,0),\"1\",\"0\")","v":"0"},0,{"$f":"SUM(Table1[[#This Row],[Case Aide Hours]],Table1[[#This Row],[Case Aide Travel Time]])","v":0},{"$f":"IFERROR(IF(OR(Table1[[#This Row],[Child Support Level]]=\"Support Services Lvl 1\", Table1[[#This Row],[Child Support Level]]=\"Support Services Lvl 2\",Table1[[#This Row],[Child Support Level]]=\"Select\"),\"Case Aid Not Allowed\", PRODUCT(Table1[[#This Row],[Total Case Aide]],VLOOKUP(Table1[[#This Row],[County Where Youth Resides]],'Drop Down'!K:M,3,0))),\"0\")","v":"Case Aid Not Allowed"},"No",0,0]
["Select","-","-","-","-","DD/MM/YYYY","DD/MM/YYYY","Select","Select",{"$f":"VLOOKUP(Table1[[#This Row],[DCYF Case Region]],'Drop Down'!$F$3:$G$9,2,0)","v":"Select"},"Select","Select","Select",{"$f":"IFERROR(IF(M216=\"No\",INDEX(IndexMatch!C:C,MATCH(1,(IndexMatch!A:A=VLOOKUP(H216,'Drop Down'!K:L,2,0))*(IndexMatch!B:B=L216),0)),\"Service Already Opened\"),\"N/A\")","v":"Service Already Opened"},0,{"$f":"IF(O216>VLOOKUP(L216,'Drop Down'!$A$3:$B$10,2,0),\"1\",\"0\")","v":"0"},0,{"$f":"SUM(Table1[[#This Row],[Case Aide Hours]],Table1[[#This Row],[Case Aide Travel Time]])","v":0},{"$f":"IFERROR(IF(OR(Table1[[#This Row],[Child Support Level]]=\"Support Services Lvl 1\", Table1[[#This Row],[Child Support Level]]=\"Support Services Lvl 2\",Table1[[#This Row],[Child Support Level]]=\"Select\"),\"Case Aid Not Allowed\", PRODUCT(Table1[[#This Row],[Total Case Aide]],VLOOKUP(Table1[[#This Row],[County Where Youth Resides]],'Drop Down'!K:M,3,0))),\"0\")","v":"Case Aid Not Allowed"},"No",0,0]
["Select","-","-","-","-","DD/MM/YYYY","DD/MM/YYYY","Select","Select",{"$f":"VLOOKUP(Table1[[#This Row],[DCYF Case Region]],'Drop Down'!$F$3:$G$9,2,0)","v":"Select"},"Select","Select","Select",{"$f":"IFERROR(IF(M217=\"No\",INDEX(IndexMatch!C:C,MATCH(1,(IndexMatch!A:A=VLOOKUP(H217,'Drop Down'!K:L,2,0))*(IndexMatch!B:B=L217),0)),\"Service Already Opened\"),\"N/A\")","v":"Service Already Opened"},0,{"$f":"IF(O217>VLOOKUP(L217,'Drop Down'!$A$3:$B$10,2,0),\"1\",\"0\")","v":"0"},0,{"$f":"SUM(Table1[[#This Row],[Case Aide Hours]],Table1[[#This Row],[Case Aide Travel Time]])","v":0},{"$f":"IFERROR(IF(OR(Table1[[#This Row],[Child Support Level]]=\"Support Services Lvl 1\", Table1[[#This Row],[Child Support Level]]=\"Support Services Lvl 2\",Table1[[#This Row],[Child Support Level]]=\"Select\"),\"Case Aid Not Allowed\", PRODUCT(Table1[[#This Row],[Total Case Aide]],VLOOKUP(Table1[[#This Row],[County Where Youth Resides]],'Drop Down'!K:M,3,0))),\"0\")","v":"Case Aid Not Allowed"},"No",0,0]
["Select","-","-","-","-","DD/MM/YYYY","DD/MM/YYYY","Select","Select",{"$f":"VLOOKUP(Table1[[#This Row],[DCYF Case Region]],'Drop Down'!$F$3:$G$9,2,0)","v":"Select"},"Select","Select","Select",{"$f":"IFERROR(IF(M218=\"No\",INDEX(IndexMatch!C:C,MATCH(1,(IndexMatch!A:A=VLOOKUP(H218,'Drop Down'!K:L,2,0))*(IndexMatch!B:B=L218),0)),\"Service Already Opened\"),\"N/A\")","v":"Service Already Opened"},0,{"$f":"IF(O218>VLOOKUP(L218,'Drop Down'!$A$3:$B$10,2,0),\"1\",\"0\")","v":"0"},0,{"$f":"SUM(Table1[[#This Row],[Case Aide Hours]],Table1[[#This Row],[Case Aide Travel Time]])","v":0},{"$f":"IFERROR(IF(OR(Table1[[#This Row],[Child Support Level]]=\"Support Services Lvl 1\", Table1[[#This Row],[Child Support Level]]=\"Support Services Lvl 2\",Table1[[#This Row],[Child Support Level]]=\"Select\"),\"Case Aid Not Allowed\", PRODUCT(Table1[[#This Row],[Total Case Aide]],VLOOKUP(Table1[[#This Row],[County Where Youth Resides]],'Drop Down'!K:M,3,0))),\"0\")","v":"Case Aid Not Allowed"},"No",0,0]
["Select","-","-","-","-","DD/MM/YYYY","DD/MM/YYYY","Select","Select",{"$f":"VLOOKUP(Table1[[#This Row],[DCYF Case Region]],'Drop Down'!$F$3:$G$9,2,0)","v":"Select"},"Select","Select","Select",{"$f":"IFERROR(IF(M219=\"No\",INDEX(IndexMatch!C:C,MATCH(1,(IndexMatch!A:A=VLOOKUP(H219,'Drop Down'!K:L,2,0))*(IndexMatch!B:B=L219),0)),\"Service Already Opened\"),\"N/A\")","v":"Service Already Opened"},0,{"$f":"IF(O219>VLOOKUP(L219,'Drop Down'!$A$3:$B$10,2,0),\"1\",\"0\")","v":"0"},0,{"$f":"SUM(Table1[[#This Row],[Case Aide Hours]],Table1[[#This Row],[Case Aide Travel Time]])","v":0},{"$f":"IFERROR(IF(OR(Table1[[#This Row],[Child Support Level]]=\"Support Services Lvl 1\", Table1[[#This Row],[Child Support Level]]=\"Support Services Lvl 2\",Table1[[#This Row],[Child Support Level]]=\"Select\"),\"Case Aid Not Allowed\", PRODUCT(Table1[[#This Row],[Total Case Aide]],VLOOKUP(Table1[[#This Row],[County Where Youth Resides]],'Drop Down'!K:M,3,0))),\"0\")","v":"Case Aid Not Allowed"},"No",0,0]
["Select","-","-","-","-","DD/MM/YYYY","DD/MM/YYYY","Select","Select",{"$f":"VLOOKUP(Table1[[#This Row],[DCYF Case Region]],'Drop Down'!$F$3:$G$9,2,0)","v":"Select"},"Select","Select","Select",{"$f":"IFERROR(IF(M220=\"No\",INDEX(IndexMatch!C:C,MATCH(1,(IndexMatch!A:A=VLOOKUP(H220,'Drop Down'!K:L,2,0))*(IndexMatch!B:B=L220),0)),\"Service Already Opened\"),\"N/A\")","v":"Service Already Opened"},0,{"$f":"IF(O220>VLOOKUP(L220,'Drop Down'!$A$3:$B$10,2,0),\"1\",\"0\")","v":"0"},0,{"$f":"SUM(Table1[[#This Row],[Case Aide Hours]],Table1[[#This Row],[Case Aide Travel Time]])","v":0},{"$f":"IFERROR(IF(OR(Table1[[#This Row],[Child Support Level]]=\"Support Services Lvl 1\", Table1[[#This Row],[Child Support Level]]=\"Support Services Lvl 2\",Table1[[#This Row],[Child Support Level]]=\"Select\"),\"Case Aid Not Allowed\", PRODUCT(Table1[[#This Row],[Total Case Aide]],VLOOKUP(Table1[[#This Row],[County Where Youth Resides]],'Drop Down'!K:M,3,0))),\"0\")","v":"Case Aid Not Allowed"},"No",0,0]
["Select","-","-","-","-","DD/MM/YYYY","DD/MM/YYYY","Select","Select",{"$f":"VLOOKUP(Table1[[#This Row],[DCYF Case Region]],'Drop Down'!$F$3:$G$9,2,0)","v":"Select"},"Select","Select","Select",{"$f":"IFERROR(IF(M221=\"No\",INDEX(IndexMatch!C:C,MATCH(1,(IndexMatch!A:A=VLOOKUP(H221,'Drop Down'!K:L,2,0))*(IndexMatch!B:B=L221),0)),\"Service Already Opened\"),\"N/A\")","v":"Service Already Opened"},0,{"$f":"IF(O221>VLOOKUP(L221,'Drop Down'!$A$3:$B$10,2,0),\"1\",\"0\")","v":"0"},0,{"$f":"SUM(Table1[[#This Row],[Case Aide Hours]],Table1[[#This Row],[Case Aide Travel Time]])","v":0},{"$f":"IFERROR(IF(OR(Table1[[#This Row],[Child Support Level]]=\"Support Services Lvl 1\", Table1[[#This Row],[Child Support Level]]=\"Support Services Lvl 2\",Table1[[#This Row],[Child Support Level]]=\"Select\"),\"Case Aid Not Allowed\", PRODUCT(Table1[[#This Row],[Total Case Aide]],VLOOKUP(Table1[[#This Row],[County Where Youth Resides]],'Drop Down'!K:M,3,0))),\"0\")","v":"Case Aid Not Allowed"},"No",0,0]
["Select","-","-","-","-","DD/MM/YYYY","DD/MM/YYYY","Select","Select",{"$f":"VLOOKUP(Table1[[#This Row],[DCYF Case Region]],'Drop Down'!$F$3:$G$9,2,0)","v":"Select"},"Select","Select","Select",{"$f":"IFERROR(IF(M222=\"No\",INDEX(IndexMatch!C:C,MATCH(1,(IndexMatch!A:A=VLOOKUP(H222,'Drop Down'!K:L,2,0))*(IndexMatch!B:B=L222),0)),\"Service Already Opened\"),\"N/A\")","v":"Service Already Opened"},0,{"$f":"IF(O222>VLOOKUP(L222,'Drop Down'!$A$3:$B$10,2,0),\"1\",\"0\")","v":"0"},0,{"$f":"SUM(Table1[[#This Row],[Case Aide Hours]],Table1[[#This Row],[Case Aide Travel Time]])","v":0},{"$f":"IFERROR(IF(OR(Table1[[#This Row],[Child Support Level]]=\"Support Services Lvl 1\", Table1[[#This Row],[Child Support Level]]=\"Support Services Lvl 2\",Table1[[#This Row],[Child Support Level]]=\"Select\"),\"Case Aid Not Allowed\", PRODUCT(Table1[[#This Row],[Total Case Aide]],VLOOKUP(Table1[[#This Row],[County Where Youth Resides]],'Drop Down'!K:M,3,0))),\"0\")","v":"Case Aid Not Allowed"},"No",0,0]
["Select","-","-","-","-","DD/MM/YYYY","DD/MM/YYYY","Select","Select",{"$f":"VLOOKUP(Table1[[#This Row],[DCYF Case Region]],'Drop Down'!$F$3:$G$9,2,0)","v":"Select"},"Select","Select","Select",{"$f":"IFERROR(IF(M223=\"No\",INDEX(IndexMatch!C:C,MATCH(1,(IndexMatch!A:A=VLOOKUP(H223,'Drop Down'!K:L,2,0))*(IndexMatch!B:B=L223),0)),\"Service Already Opened\"),\"N/A\")","v":"Service Already Opened"},0,{"$f":"IF(O223>VLOOKUP(L223,'Drop Down'!$A$3:$B$10,2,0),\"1\",\"0\")","v":"0"},0,{"$f":"SUM(Table1[[#This Row],[Case Aide Hours]],Table1[[#This Row],[Case Aide Travel Time]])","v":0},{"$f":"IFERROR(IF(OR(Table1[[#This Row],[Child Support Level]]=\"Support Services Lvl 1\", Table1[[#This Row],[Child Support Level]]=\"Support Services Lvl 2\",Table1[[#This Row],[Child Support Level]]=\"Select\"),\"Case Aid Not Allowed\", PRODUCT(Table1[[#This Row],[Total Case Aide]],VLOOKUP(Table1[[#This Row],[County Where Youth Resides]],'Drop Down'!K:M,3,0))),\"0\")","v":"Case Aid Not Allowed"},"No",0,0]
["Select","-","-","-","-","DD/MM/YYYY","DD/MM/YYYY","Select","Select",{"$f":"VLOOKUP(Table1[[#This Row],[DCYF Case Region]],'Drop Down'!$F$3:$G$9,2,0)","v":"Select"},"Select","Select","Select",{"$f":"IFERROR(IF(M224=\"No\",INDEX(IndexMatch!C:C,MATCH(1,(IndexMatch!A:A=VLOOKUP(H224,'Drop Down'!K:L,2,0))*(IndexMatch!B:B=L224),0)),\"Service Already Opened\"),\"N/A\")","v":"Service Already Opened"},0,{"$f":"IF(O224>VLOOKUP(L224,'Drop Down'!$A$3:$B$10,2,0),\"1\",\"0\")","v":"0"},0,{"$f":"SUM(Table1[[#This Row],[Case Aide Hours]],Table1[[#This Row],[Case Aide Travel Time]])","v":0},{"$f":"IFERROR(IF(OR(Table1[[#This Row],[Child Support Level]]=\"Support Services Lvl 1\", Table1[[#This Row],[Child Support Level]]=\"Support Services Lvl 2\",Table1[[#This Row],[Child Support Level]]=\"Select\"),\"Case Aid Not Allowed\", PRODUCT(Table1[[#This Row],[Total Case Aide]],VLOOKUP(Table1[[#This Row],[County Where Youth Resides]],'Drop Down'!K:M,3,0))),\"0\")","v":"Case Aid Not Allowed"},"No",0,0]
["Select","-","-","-","-","DD/MM/YYYY","DD/MM/YYYY","Select","Select",{"$f":"VLOOKUP(Table1[[#This Row],[DCYF Case Region]],'Drop Down'!$F$3:$G$9,2,0)","v":"Select"},"Select","Select","Select",{"$f":"IFERROR(IF(M225=\"No\",INDEX(IndexMatch!C:C,MATCH(1,(IndexMatch!A:A=VLOOKUP(H225,'Drop Down'!K:L,2,0))*(IndexMatch!B:B=L225),0)),\"Service Already Opened\"),\"N/A\")","v":"Service Already Opened"},0,{"$f":"IF(O225>VLOOKUP(L225,'Drop Down'!$A$3:$B$10,2,0),\"1\",\"0\")","v":"0"},0,{"$f":"SUM(Table1[[#This Row],[Case Aide Hours]],Table1[[#This Row],[Case Aide Travel Time]])","v":0},{"$f":"IFERROR(IF(OR(Table1[[#This Row],[Child Support Level]]=\"Support Services Lvl 1\", Table1[[#This Row],[Child Support Level]]=\"Support Services Lvl 2\",Table1[[#This Row],[Child Support Level]]=\"Select\"),\"Case Aid Not Allowed\", PRODUCT(Table1[[#This Row],[Total Case Aide]],VLOOKUP(Table1[[#This Row],[County Where Youth Resides]],'Drop Down'!K:M,3,0))),\"0\")","v":"Case Aid Not Allowed"},"No",0,0]
["Select","-","-","-","-","DD/MM/YYYY","DD/MM/YYYY","Select","Select",{"$f":"VLOOKUP(Table1[[#This Row],[DCYF Case Region]],'Drop Down'!$F$3:$G$9,2,0)","v":"Select"},"Select","Select","Select",{"$f":"IFERROR(IF(M226=\"No\",INDEX(IndexMatch!C:C,MATCH(1,(IndexMatch!A:A=VLOOKUP(H226,'Drop Down'!K:L,2,0))*(IndexMatch!B:B=L226),0)),\"Service Already Opened\"),\"N/A\")","v":"Service Already Opened"},0,{"$f":"IF(O226>VLOOKUP(L226,'Drop Down'!$A$3:$B$10,2,0),\"1\",\"0\")","v":"0"},0,{"$f":"SUM(Table1[[#This Row],[Case Aide Hours]],Table1[[#This Row],[Case Aide Travel Time]])","v":0},{"$f":"IFERROR(IF(OR(Table1[[#This Row],[Child Support Level]]=\"Support Services Lvl 1\", Table1[[#This Row],[Child Support Level]]=\"Support Services Lvl 2\",Table1[[#This Row],[Child Support Level]]=\"Select\"),\"Case Aid Not Allowed\", PRODUCT(Table1[[#This Row],[Total Case Aide]],VLOOKUP(Table1[[#This Row],[County Where Youth Resides]],'Drop Down'!K:M,3,0))),\"0\")","v":"Case Aid Not Allowed"},"No",0,0]
["Select","-","-","-","-","DD/MM/YYYY","DD/MM/YYYY","Select","Select",{"$f":"VLOOKUP(Table1[[#This Row],[DCYF Case Region]],'Drop Down'!$F$3:$G$9,2,0)","v":"Select"},"Select","Select","Select",{"$f":"IFERROR(IF(M227=\"No\",INDEX(IndexMatch!C:C,MATCH(1,(IndexMatch!A:A=VLOOKUP(H227,'Drop Down'!K:L,2,0))*(IndexMatch!B:B=L227),0)),\"Service Already Opened\"),\"N/A\")","v":"Service Already Opened"},0,{"$f":"IF(O227>VLOOKUP(L227,'Drop Down'!$A$3:$B$10,2,0),\"1\",\"0\")","v":"0"},0,{"$f":"SUM(Table1[[#This Row],[Case Aide Hours]],Table1[[#This Row],[Case Aide Travel Time]])","v":0},{"$f":"IFERROR(IF(OR(Table1[[#This Row],[Child Support Level]]=\"Support Services Lvl 1\", Table1[[#This Row],[Child Support Level]]=\"Support Services Lvl 2\",Table1[[#This Row],[Child Support Level]]=\"Select\"),\"Case Aid Not Allowed\", PRODUCT(Table1[[#This Row],[Total Case Aide]],VLOOKUP(Table1[[#This Row],[County Where Youth Resides]],'Drop Down'!K:M,3,0))),\"0\")","v":"Case Aid Not Allowed"},"No",0,0]
["Select","-","-","-","-","DD/MM/YYYY","DD/MM/YYYY","Select","Select",{"$f":"VLOOKUP(Table1[[#This Row],[DCYF Case Region]],'Drop Down'!$F$3:$G$9,2,0)","v":"Select"},"Select","Select","Select",{"$f":"IFERROR(IF(M228=\"No\",INDEX(IndexMatch!C:C,MATCH(1,(IndexMatch!A:A=VLOOKUP(H228,'Drop Down'!K:L,2,0))*(IndexMatch!B:B=L228),0)),\"Service Already Opened\"),\"N/A\")","v":"Service Already Opened"},0,{"$f":"IF(O228>VLOOKUP(L228,'Drop Down'!$A$3:$B$10,2,0),\"1\",\"0\")","v":"0"},0,{"$f":"SUM(Table1[[#This Row],[Case Aide Hours]],Table1[[#This Row],[Case Aide Travel Time]])","v":0},{"$f":"IFERROR(IF(OR(Table1[[#This Row],[Child Support Level]]=\"Support Services Lvl 1\", Table1[[#This Row],[Child Support Level]]=\"Support Services Lvl 2\",Table1[[#This Row],[Child Support Level]]=\"Select\"),\"Case Aid Not Allowed\", PRODUCT(Table1[[#This Row],[Total Case Aide]],VLOOKUP(Table1[[#This Row],[County Where Youth Resides]],'Drop Down'!K:M,3,0))),\"0\")","v":"Case Aid Not Allowed"},"No",0,0]
["Select","-","-","-","-","DD/MM/YYYY","DD/MM/YYYY","Select","Select",{"$f":"VLOOKUP(Table1[[#This Row],[DCYF Case Region]],'Drop Down'!$F$3:$G$9,2,0)","v":"Select"},"Select","Select","Select",{"$f":"IFERROR(IF(M229=\"No\",INDEX(IndexMatch!C:C,MATCH(1,(IndexMatch!A:A=VLOOKUP(H229,'Drop Down'!K:L,2,0))*(IndexMatch!B:B=L229),0)),\"Service Already Opened\"),\"N/A\")","v":"Service Already Opened"},0,{"$f":"IF(O229>VLOOKUP(L229,'Drop Down'!$A$3:$B$10,2,0),\"1\",\"0\")","v":"0"},0,{"$f":"SUM(Table1[[#This Row],[Case Aide Hours]],Table1[[#This Row],[Case Aide Travel Time]])","v":0},{"$f":"IFERROR(IF(OR(Table1[[#This Row],[Child Support Level]]=\"Support Services Lvl 1\", Table1[[#This Row],[Child Support Level]]=\"Support Services Lvl 2\",Table1[[#This Row],[Child Support Level]]=\"Select\"),\"Case Aid Not Allowed\", PRODUCT(Table1[[#This Row],[Total Case Aide]],VLOOKUP(Table1[[#This Row],[County Where Youth Resides]],'Drop Down'!K:M,3,0))),\"0\")","v":"Case Aid Not Allowed"},"No",0,0]
["Select","-","-","-","-","DD/MM/YYYY","DD/MM/YYYY","Select","Select",{"$f":"VLOOKUP(Table1[[#This Row],[DCYF Case Region]],'Drop Down'!$F$3:$G$9,2,0)","v":"Select"},"Select","Select","Select",{"$f":"IFERROR(IF(M230=\"No\",INDEX(IndexMatch!C:C,MATCH(1,(IndexMatch!A:A=VLOOKUP(H230,'Drop Down'!K:L,2,0))*(IndexMatch!B:B=L230),0)),\"Service Already Opened\"),\"N/A\")","v":"Service Already Opened"},0,{"$f":"IF(O230>VLOOKUP(L230,'Drop Down'!$A$3:$B$10,2,0),\"1\",\"0\")","v":"0"},0,{"$f":"SUM(Table1[[#This Row],[Case Aide Hours]],Table1[[#This Row],[Case Aide Travel Time]])","v":0},{"$f":"IFERROR(IF(OR(Table1[[#This Row],[Child Support Level]]=\"Support Services Lvl 1\", Table1[[#This Row],[Child Support Level]]=\"Support Services Lvl 2\",Table1[[#This Row],[Child Support Level]]=\"Select\"),\"Case Aid Not Allowed\", PRODUCT(Table1[[#This Row],[Total Case Aide]],VLOOKUP(Table1[[#This Row],[County Where Youth Resides]],'Drop Down'!K:M,3,0))),\"0\")","v":"Case Aid Not Allowed"},"No",0,0]
["Select","-","-","-","-","DD/MM/YYYY","DD/MM/YYYY","Select","Select",{"$f":"VLOOKUP(Table1[[#This Row],[DCYF Case Region]],'Drop Down'!$F$3:$G$9,2,0)","v":"Select"},"Select","Select","Select",{"$f":"IFERROR(IF(M231=\"No\",INDEX(IndexMatch!C:C,MATCH(1,(IndexMatch!A:A=VLOOKUP(H231,'Drop Down'!K:L,2,0))*(IndexMatch!B:B=L231),0)),\"Service Already Opened\"),\"N/A\")","v":"Service Already Opened"},0,{"$f":"IF(O231>VLOOKUP(L231,'Drop Down'!$A$3:$B$10,2,0),\"1\",\"0\")","v":"0"},0,{"$f":"SUM(Table1[[#This Row],[Case Aide Hours]],Table1[[#This Row],[Case Aide Travel Time]])","v":0},{"$f":"IFERROR(IF(OR(Table1[[#This Row],[Child Support Level]]=\"Support Services Lvl 1\", Table1[[#This Row],[Child Support Level]]=\"Support Services Lvl 2\",Table1[[#This Row],[Child Support Level]]=\"Select\"),\"Case Aid Not Allowed\", PRODUCT(Table1[[#This Row],[Total Case Aide]],VLOOKUP(Table1[[#This Row],[County Where Youth Resides]],'Drop Down'!K:M,3,0))),\"0\")","v":"Case Aid Not Allowed"},"No",0,0]
["Select","-","-","-","-","DD/MM/YYYY","DD/MM/YYYY","Select","Select",{"$f":"VLOOKUP(Table1[[#This Row],[DCYF Case Region]],'Drop Down'!$F$3:$G$9,2,0)","v":"Select"},"Select","Select","Select",{"$f":"IFERROR(IF(M232=\"No\",INDEX(IndexMatch!C:C,MATCH(1,(IndexMatch!A:A=VLOOKUP(H232,'Drop Down'!K:L,2,0))*(IndexMatch!B:B=L232),0)),\"Service Already Opened\"),\"N/A\")","v":"Service Already Opened"},0,{"$f":"IF(O232>VLOOKUP(L232,'Drop Down'!$A$3:$B$10,2,0),\"1\",\"0\")","v":"0"},0,{"$f":"SUM(Table1[[#This Row],[Case Aide Hours]],Table1[[#This Row],[Case Aide Travel Time]])","v":0},{"$f":"IFERROR(IF(OR(Table1[[#This Row],[Child Support Level]]=\"Support Services Lvl 1\", Table1[[#This Row],[Child Support Level]]=\"Support Services Lvl 2\",Table1[[#This Row],[Child Support Level]]=\"Select\"),\"Case Aid Not Allowed\", PRODUCT(Table1[[#This Row],[Total Case Aide]],VLOOKUP(Table1[[#This Row],[County Where Youth Resides]],'Drop Down'!K:M,3,0))),\"0\")","v":"Case Aid Not Allowed"},"No",0,0]
["Select","-","-","-","-","DD/MM/YYYY","DD/MM/YYYY","Select","Select",{"$f":"VLOOKUP(Table1[[#This Row],[DCYF Case Region]],'Drop Down'!$F$3:$G$9,2,0)","v":"Select"},"Select","Select","Select",{"$f":"IFERROR(IF(M233=\"No\",INDEX(IndexMatch!C:C,MATCH(1,(IndexMatch!A:A=VLOOKUP(H233,'Drop Down'!K:L,2,0))*(IndexMatch!B:B=L233),0)),\"Service Already Opened\"),\"N/A\")","v":"Service Already Opened"},0,{"$f":"IF(O233>VLOOKUP(L233,'Drop Down'!$A$3:$B$10,2,0),\"1\",\"0\")","v":"0"},0,{"$f":"SUM(Table1[[#This Row],[Case Aide Hours]],Table1[[#This Row],[Case Aide Travel Time]])","v":0},{"$f":"IFERROR(IF(OR(Table1[[#This Row],[Child Support Level]]=\"Support Services Lvl 1\", Table1[[#This Row],[Child Support Level]]=\"Support Services Lvl 2\",Table1[[#This Row],[Child Support Level]]=\"Select\"),\"Case Aid Not Allowed\", PRODUCT(Table1[[#This Row],[Total Case Aide]],VLOOKUP(Table1[[#This Row],[County Where Youth Resides]],'Drop Down'!K:M,3,0))),\"0\")","v":"Case Aid Not Allowed"},"No",0,0]
["Select","-","-","-","-","DD/MM/YYYY","DD/MM/YYYY","Select","Select",{"$f":"VLOOKUP(Table1[[#This Row],[DCYF Case Region]],'Drop Down'!$F$3:$G$9,2,0)","v":"Select"},"Select","Select","Select",{"$f":"IFERROR(IF(M234=\"No\",INDEX(IndexMatch!C:C,MATCH(1,(IndexMatch!A:A=VLOOKUP(H234,'Drop Down'!K:L,2,0))*(IndexMatch!B:B=L234),0)),\"Service Already Opened\"),\"N/A\")","v":"Service Already Opened"},0,{"$f":"IF(O234>VLOOKUP(L234,'Drop Down'!$A$3:$B$10,2,0),\"1\",\"0\")","v":"0"},0,{"$f":"SUM(Table1[[#This Row],[Case Aide Hours]],Table1[[#This Row],[Case Aide Travel Time]])","v":0},{"$f":"IFERROR(IF(OR(Table1[[#This Row],[Child Support Level]]=\"Support Services Lvl 1\", Table1[[#This Row],[Child Support Level]]=\"Support Services Lvl 2\",Table1[[#This Row],[Child Support Level]]=\"Select\"),\"Case Aid Not Allowed\", PRODUCT(Table1[[#This Row],[Total Case Aide]],VLOOKUP(Table1[[#This Row],[County Where Youth Resides]],'Drop Down'!K:M,3,0))),\"0\")","v":"Case Aid Not Allowed"},"No",0,0]
["Select","-","-","-","-","DD/MM/YYYY","DD/MM/YYYY","Select","Select",{"$f":"VLOOKUP(Table1[[#This Row],[DCYF Case Region]],'Drop Down'!$F$3:$G$9,2,0)","v":"Select"},"Select","Select","Select",{"$f":"IFERROR(IF(M235=\"No\",INDEX(IndexMatch!C:C,MATCH(1,(IndexMatch!A:A=VLOOKUP(H235,'Drop Down'!K:L,2,0))*(IndexMatch!B:B=L235),0)),\"Service Already Opened\"),\"N/A\")","v":"Service Already Opened"},0,{"$f":"IF(O235>VLOOKUP(L235,'Drop Down'!$A$3:$B$10,2,0),\"1\",\"0\")","v":"0"},0,{"$f":"SUM(Table1[[#This Row],[Case Aide Hours]],Table1[[#This Row],[Case Aide Travel Time]])","v":0},{"$f":"IFERROR(IF(OR(Table1[[#This Row],[Child Support Level]]=\"Support Services Lvl 1\", Table1[[#This Row],[Child Support Level]]=\"Support Services Lvl 2\",Table1[[#This Row],[Child Support Level]]=\"Select\"),\"Case Aid Not Allowed\", PRODUCT(Table1[[#This Row],[Total Case Aide]],VLOOKUP(Table1[[#This Row],[County Where Youth Resides]],'Drop Down'!K:M,3,0))),\"0\")","v":"Case Aid Not Allowed"},"No",0,0]
["Select","-","-","-","-","DD/MM/YYYY","DD/MM/YYYY","Select","Select",{"$f":"VLOOKUP(Table1[[#This Row],[DCYF Case Region]],'Drop Down'!$F$3:$G$9,2,0)","v":"Select"},"Select","Select","Select",{"$f":"IFERROR(IF(M236=\"No\",INDEX(IndexMatch!C:C,MATCH(1,(IndexMatch!A:A=VLOOKUP(H236,'Drop Down'!K:L,2,0))*(IndexMatch!B:B=L236),0)),\"Service Already Opened\"),\"N/A\")","v":"Service Already Opened"},0,{"$f":"IF(O236>VLOOKUP(L236,'Drop Down'!$A$3:$B$10,2,0),\"1\",\"0\")","v":"0"},0,{"$f":"SUM(Table1[[#This Row],[Case Aide Hours]],Table1[[#This Row],[Case Aide Travel Time]])","v":0},{"$f":"IFERROR(IF(OR(Table1[[#This Row],[Child Support Level]]=\"Support Services Lvl 1\", Table1[[#This Row],[Child Support Level]]=\"Support Services Lvl 2\",Table1[[#This Row],[Child Support Level]]=\"Select\"),\"Case Aid Not Allowed\", PRODUCT(Table1[[#This Row],[Total Case Aide]],VLOOKUP(Table1[[#This Row],[County Where Youth Resides]],'Drop Down'!K:M,3,0))),\"0\")","v":"Case Aid Not Allowed"},"No",0,0]
["Select","-","-","-","-","DD/MM/YYYY","DD/MM/YYYY","Select","Select",{"$f":"VLOOKUP(Table1[[#This Row],[DCYF Case Region]],'Drop Down'!$F$3:$G$9,2,0)","v":"Select"},"Select","Select","Select",{"$f":"IFERROR(IF(M237=\"No\",INDEX(IndexMatch!C:C,MATCH(1,(IndexMatch!A:A=VLOOKUP(H237,'Drop Down'!K:L,2,0))*(IndexMatch!B:B=L237),0)),\"Service Already Opened\"),\"N/A\")","v":"Service Already Opened"},0,{"$f":"IF(O237>VLOOKUP(L237,'Drop Down'!$A$3:$B$10,2,0),\"1\",\"0\")","v":"0"},0,{"$f":"SUM(Table1[[#This Row],[Case Aide Hours]],Table1[[#This Row],[Case Aide Travel Time]])","v":0},{"$f":"IFERROR(IF(OR(Table1[[#This Row],[Child Support Level]]=\"Support Services Lvl 1\", Table1[[#This Row],[Child Support Level]]=\"Support Services Lvl 2\",Table1[[#This Row],[Child Support Level]]=\"Select\"),\"Case Aid Not Allowed\", PRODUCT(Table1[[#This Row],[Total Case Aide]],VLOOKUP(Table1[[#This Row],[County Where Youth Resides]],'Drop Down'!K:M,3,0))),\"0\")","v":"Case Aid Not Allowed"},"No",0,0]
["Select","-","-","-","-","DD/MM/YYYY","DD/MM/YYYY","Select","Select",{"$f":"VLOOKUP(Table1[[#This Row],[DCYF Case Region]],'Drop Down'!$F$3:$G$9,2,0)","v":"Select"},"Select","Select","Select",{"$f":"IFERROR(IF(M238=\"No\",INDEX(IndexMatch!C:C,MATCH(1,(IndexMatch!A:A=VLOOKUP(H238,'Drop Down'!K:L,2,0))*(IndexMatch!B:B=L238),0)),\"Service Already Opened\"),\"N/A\")","v":"Service Already Opened"},0,{"$f":"IF(O238>VLOOKUP(L238,'Drop Down'!$A$3:$B$10,2,0),\"1\",\"0\")","v":"0"},0,{"$f":"SUM(Table1[[#This Row],[Case Aide Hours]],Table1[[#This Row],[Case Aide Travel Time]])","v":0},{"$f":"IFERROR(IF(OR(Table1[[#This Row],[Child Support Level]]=\"Support Services Lvl 1\", Table1[[#This Row],[Child Support Level]]=\"Support Services Lvl 2\",Table1[[#This Row],[Child Support Level]]=\"Select\"),\"Case Aid Not Allowed\", PRODUCT(Table1[[#This Row],[Total Case Aide]],VLOOKUP(Table1[[#This Row],[County Where Youth Resides]],'Drop Down'!K:M,3,0))),\"0\")","v":"Case Aid Not Allowed"},"No",0,0]
["Select","-","-","-","-","DD/MM/YYYY","DD/MM/YYYY","Select","Select",{"$f":"VLOOKUP(Table1[[#This Row],[DCYF Case Region]],'Drop Down'!$F$3:$G$9,2,0)","v":"Select"},"Select","Select","Select",{"$f":"IFERROR(IF(M239=\"No\",INDEX(IndexMatch!C:C,MATCH(1,(IndexMatch!A:A=VLOOKUP(H239,'Drop Down'!K:L,2,0))*(IndexMatch!B:B=L239),0)),\"Service Already Opened\"),\"N/A\")","v":"Service Already Opened"},0,{"$f":"IF(O239>VLOOKUP(L239,'Drop Down'!$A$3:$B$10,2,0),\"1\",\"0\")","v":"0"},0,{"$f":"SUM(Table1[[#This Row],[Case Aide Hours]],Table1[[#This Row],[Case Aide Travel Time]])","v":0},{"$f":"IFERROR(IF(OR(Table1[[#This Row],[Child Support Level]]=\"Support Services Lvl 1\", Table1[[#This Row],[Child Support Level]]=\"Support Services Lvl 2\",Table1[[#This Row],[Child Support Level]]=\"Select\"),\"Case Aid Not Allowed\", PRODUCT(Table1[[#This Row],[Total Case Aide]],VLOOKUP(Table1[[#This Row],[County Where Youth Resides]],'Drop Down'!K:M,3,0))),\"0\")","v":"Case Aid Not Allowed"},"No",0,0]
["Select","-","-","-","-","DD/MM/YYYY","DD/MM/YYYY","Select","Select",{"$f":"VLOOKUP(Table1[[#This Row],[DCYF Case Region]],'Drop Down'!$F$3:$G$9,2,0)","v":"Select"},"Select","Select","Select",{"$f":"IFERROR(IF(M240=\"No\",INDEX(IndexMatch!C:C,MATCH(1,(IndexMatch!A:A=VLOOKUP(H240,'Drop Down'!K:L,2,0))*(IndexMatch!B:B=L240),0)),\"Service Already Opened\"),\"N/A\")","v":"Service Already Opened"},0,{"$f":"IF(O240>VLOOKUP(L240,'Drop Down'!$A$3:$B$10,2,0),\"1\",\"0\")","v":"0"},0,{"$f":"SUM(Table1[[#This Row],[Case Aide Hours]],Table1[[#This Row],[Case Aide Travel Time]])","v":0},{"$f":"IFERROR(IF(OR(Table1[[#This Row],[Child Support Level]]=\"Support Services Lvl 1\", Table1[[#This Row],[Child Support Level]]=\"Support Services Lvl 2\",Table1[[#This Row],[Child Support Level]]=\"Select\"),\"Case Aid Not Allowed\", PRODUCT(Table1[[#This Row],[Total Case Aide]],VLOOKUP(Table1[[#This Row],[County Where Youth Resides]],'Drop Down'!K:M,3,0))),\"0\")","v":"Case Aid Not Allowed"},"No",0,0]
["Select","-","-","-","-","DD/MM/YYYY","DD/MM/YYYY","Select","Select",{"$f":"VLOOKUP(Table1[[#This Row],[DCYF Case Region]],'Drop Down'!$F$3:$G$9,2,0)","v":"Select"},"Select","Select","Select",{"$f":"IFERROR(IF(M241=\"No\",INDEX(IndexMatch!C:C,MATCH(1,(IndexMatch!A:A=VLOOKUP(H241,'Drop Down'!K:L,2,0))*(IndexMatch!B:B=L241),0)),\"Service Already Opened\"),\"N/A\")","v":"Service Already Opened"},0,{"$f":"IF(O241>VLOOKUP(L241,'Drop Down'!$A$3:$B$10,2,0),\"1\",\"0\")","v":"0"},0,{"$f":"SUM(Table1[[#This Row],[Case Aide Hours]],Table1[[#This Row],[Case Aide Travel Time]])","v":0},{"$f":"IFERROR(IF(OR(Table1[[#This Row],[Child Support Level]]=\"Support Services Lvl 1\", Table1[[#This Row],[Child Support Level]]=\"Support Services Lvl 2\",Table1[[#This Row],[Child Support Level]]=\"Select\"),\"Case Aid Not Allowed\", PRODUCT(Table1[[#This Row],[Total Case Aide]],VLOOKUP(Table1[[#This Row],[County Where Youth Resides]],'Drop Down'!K:M,3,0))),\"0\")","v":"Case Aid Not Allowed"},"No",0,0]
["Select","-","-","-","-","DD/MM/YYYY","DD/MM/YYYY","Select","Select",{"$f":"VLOOKUP(Table1[[#This Row],[DCYF Case Region]],'Drop Down'!$F$3:$G$9,2,0)","v":"Select"},"Select","Select","Select",{"$f":"IFERROR(IF(M242=\"No\",INDEX(IndexMatch!C:C,MATCH(1,(IndexMatch!A:A=VLOOKUP(H242,'Drop Down'!K:L,2,0))*(IndexMatch!B:B=L242),0)),\"Service Already Opened\"),\"N/A\")","v":"Service Already Opened"},0,{"$f":"IF(O242>VLOOKUP(L242,'Drop Down'!$A$3:$B$10,2,0),\"1\",\"0\")","v":"0"},0,{"$f":"SUM(Table1[[#This Row],[Case Aide Hours]],Table1[[#This Row],[Case Aide Travel Time]])","v":0},{"$f":"IFERROR(IF(OR(Table1[[#This Row],[Child Support Level]]=\"Support Services Lvl 1\", Table1[[#This Row],[Child Support Level]]=\"Support Services Lvl 2\",Table1[[#This Row],[Child Support Level]]=\"Select\"),\"Case Aid Not Allowed\", PRODUCT(Table1[[#This Row],[Total Case Aide]],VLOOKUP(Table1[[#This Row],[County Where Youth Resides]],'Drop Down'!K:M,3,0))),\"0\")","v":"Case Aid Not Allowed"},"No",0,0]
["Select","-","-","-","-","DD/MM/YYYY","DD/MM/YYYY","Select","Select",{"$f":"VLOOKUP(Table1[[#This Row],[DCYF Case Region]],'Drop Down'!$F$3:$G$9,2,0)","v":"Select"},"Select","Select","Select",{"$f":"IFERROR(IF(M243=\"No\",INDEX(IndexMatch!C:C,MATCH(1,(IndexMatch!A:A=VLOOKUP(H243,'Drop Down'!K:L,2,0))*(IndexMatch!B:B=L243),0)),\"Service Already Opened\"),\"N/A\")","v":"Service Already Opened"},0,{"$f":"IF(O243>VLOOKUP(L243,'Drop Down'!$A$3:$B$10,2,0),\"1\",\"0\")","v":"0"},0,{"$f":"SUM(Table1[[#This Row],[Case Aide Hours]],Table1[[#This Row],[Case Aide Travel Time]])","v":0},{"$f":"IFERROR(IF(OR(Table1[[#This Row],[Child Support Level]]=\"Support Services Lvl 1\", Table1[[#This Row],[Child Support Level]]=\"Support Services Lvl 2\",Table1[[#This Row],[Child Support Level]]=\"Select\"),\"Case Aid Not Allowed\", PRODUCT(Table1[[#This Row],[Total Case Aide]],VLOOKUP(Table1[[#This Row],[County Where Youth Resides]],'Drop Down'!K:M,3,0))),\"0\")","v":"Case Aid Not Allowed"},"No",0,0]
["Select","-","-","-","-","DD/MM/YYYY","DD/MM/YYYY","Select","Select",{"$f":"VLOOKUP(Table1[[#This Row],[DCYF Case Region]],'Drop Down'!$F$3:$G$9,2,0)","v":"Select"},"Select","Select","Select",{"$f":"IFERROR(IF(M244=\"No\",INDEX(IndexMatch!C:C,MATCH(1,(IndexMatch!A:A=VLOOKUP(H244,'Drop Down'!K:L,2,0))*(IndexMatch!B:B=L244),0)),\"Service Already Opened\"),\"N/A\")","v":"Service Already Opened"},0,{"$f":"IF(O244>VLOOKUP(L244,'Drop Down'!$A$3:$B$10,2,0),\"1\",\"0\")","v":"0"},0,{"$f":"SUM(Table1[[#This Row],[Case Aide Hours]],Table1[[#This Row],[Case Aide Travel Time]])","v":0},{"$f":"IFERROR(IF(OR(Table1[[#This Row],[Child Support Level]]=\"Support Services Lvl 1\", Table1[[#This Row],[Child Support Level]]=\"Support Services Lvl 2\",Table1[[#This Row],[Child Support Level]]=\"Select\"),\"Case Aid Not Allowed\", PRODUCT(Table1[[#This Row],[Total Case Aide]],VLOOKUP(Table1[[#This Row],[County Where Youth Resides]],'Drop Down'!K:M,3,0))),\"0\")","v":"Case Aid Not Allowed"},"No",0,0]
["Select","-","-","-","-","DD/MM/YYYY","DD/MM/YYYY","Select","Select",{"$f":"VLOOKUP(Table1[[#This Row],[DCYF Case Region]],'Drop Down'!$F$3:$G$9,2,0)","v":"Select"},"Select","Select","Select",{"$f":"IFERROR(IF(M245=\"No\",INDEX(IndexMatch!C:C,MATCH(1,(IndexMatch!A:A=VLOOKUP(H245,'Drop Down'!K:L,2,0))*(IndexMatch!B:B=L245),0)),\"Service Already Opened\"),\"N/A\")","v":"Service Already Opened"},0,{"$f":"IF(O245>VLOOKUP(L245,'Drop Down'!$A$3:$B$10,2,0),\"1\",\"0\")","v":"0"},0,{"$f":"SUM(Table1[[#This Row],[Case Aide Hours]],Table1[[#This Row],[Case Aide Travel Time]])","v":0},{"$f":"IFERROR(IF(OR(Table1[[#This Row],[Child Support Level]]=\"Support Services Lvl 1\", Table1[[#This Row],[Child Support Level]]=\"Support Services Lvl 2\",Table1[[#This Row],[Child Support Level]]=\"Select\"),\"Case Aid Not Allowed\", PRODUCT(Table1[[#This Row],[Total Case Aide]],VLOOKUP(Table1[[#This Row],[County Where Youth Resides]],'Drop Down'!K:M,3,0))),\"0\")","v":"Case Aid Not Allowed"},"No",0,0]
["Select","-","-","-","-","DD/MM/YYYY","DD/MM/YYYY","Select","Select",{"$f":"VLOOKUP(Table1[[#This Row],[DCYF Case Region]],'Drop Down'!$F$3:$G$9,2,0)","v":"Select"},"Select","Select","Select",{"$f":"IFERROR(IF(M246=\"No\",INDEX(IndexMatch!C:C,MATCH(1,(IndexMatch!A:A=VLOOKUP(H246,'Drop Down'!K:L,2,0))*(IndexMatch!B:B=L246),0)),\"Service Already Opened\"),\"N/A\")","v":"Service Already Opened"},0,{"$f":"IF(O246>VLOOKUP(L246,'Drop Down'!$A$3:$B$10,2,0),\"1\",\"0\")","v":"0"},0,{"$f":"SUM(Table1[[#This Row],[Case Aide Hours]],Table1[[#This Row],[Case Aide Travel Time]])","v":0},{"$f":"IFERROR(IF(OR(Table1[[#This Row],[Child Support Level]]=\"Support Services Lvl 1\", Table1[[#This Row],[Child Support Level]]=\"Support Services Lvl 2\",Table1[[#This Row],[Child Support Level]]=\"Select\"),\"Case Aid Not Allowed\", PRODUCT(Table1[[#This Row],[Total Case Aide]],VLOOKUP(Table1[[#This Row],[County Where Youth Resides]],'Drop Down'!K:M,3,0))),\"0\")","v":"Case Aid Not Allowed"},"No",0,0]
["Select","-","-","-","-","DD/MM/YYYY","DD/MM/YYYY","Select","Select",{"$f":"VLOOKUP(Table1[[#This Row],[DCYF Case Region]],'Drop Down'!$F$3:$G$9,2,0)","v":"Select"},"Select","Select","Select",{"$f":"IFERROR(IF(M247=\"No\",INDEX(IndexMatch!C:C,MATCH(1,(IndexMatch!A:A=VLOOKUP(H247,'Drop Down'!K:L,2,0))*(IndexMatch!B:B=L247),0)),\"Service Already Opened\"),\"N/A\")","v":"Service Already Opened"},0,{"$f":"IF(O247>VLOOKUP(L247,'Drop Down'!$A$3:$B$10,2,0),\"1\",\"0\")","v":"0"},0,{"$f":"SUM(Table1[[#This Row],[Case Aide Hours]],Table1[[#This Row],[Case Aide Travel Time]])","v":0},{"$f":"IFERROR(IF(OR(Table1[[#This Row],[Child Support Level]]=\"Support Services Lvl 1\", Table1[[#This Row],[Child Support Level]]=\"Support Services Lvl 2\",Table1[[#This Row],[Child Support Level]]=\"Select\"),\"Case Aid Not Allowed\", PRODUCT(Table1[[#This Row],[Total Case Aide]],VLOOKUP(Table1[[#This Row],[County Where Youth Resides]],'Drop Down'!K:M,3,0))),\"0\")","v":"Case Aid Not Allowed"},"No",0,0]
["Select","-","-","-","-","DD/MM/YYYY","DD/MM/YYYY","Select","Select",{"$f":"VLOOKUP(Table1[[#This Row],[DCYF Case Region]],'Drop Down'!$F$3:$G$9,2,0)","v":"Select"},"Select","Select","Select",{"$f":"IFERROR(IF(M248=\"No\",INDEX(IndexMatch!C:C,MATCH(1,(IndexMatch!A:A=VLOOKUP(H248,'Drop Down'!K:L,2,0))*(IndexMatch!B:B=L248),0)),\"Service Already Opened\"),\"N/A\")","v":"Service Already Opened"},0,{"$f":"IF(O248>VLOOKUP(L248,'Drop Down'!$A$3:$B$10,2,0),\"1\",\"0\")","v":"0"},0,{"$f":"SUM(Table1[[#This Row],[Case Aide Hours]],Table1[[#This Row],[Case Aide Travel Time]])","v":0},{"$f":"IFERROR(IF(OR(Table1[[#This Row],[Child Support Level]]=\"Support Services Lvl 1\", Table1[[#This Row],[Child Support Level]]=\"Support Services Lvl 2\",Table1[[#This Row],[Child Support Level]]=\"Select\"),\"Case Aid Not Allowed\", PRODUCT(Table1[[#This Row],[Total Case Aide]],VLOOKUP(Table1[[#This Row],[County Where Youth Resides]],'Drop Down'!K:M,3,0))),\"0\")","v":"Case Aid Not Allowed"},"No",0,0]
["Select","-","-","-","-","DD/MM/YYYY","DD/MM/YYYY","Select","Select",{"$f":"VLOOKUP(Table1[[#This Row],[DCYF Case Region]],'Drop Down'!$F$3:$G$9,2,0)","v":"Select"},"Select","Select","Select",{"$f":"IFERROR(IF(M249=\"No\",INDEX(IndexMatch!C:C,MATCH(1,(IndexMatch!A:A=VLOOKUP(H249,'Drop Down'!K:L,2,0))*(IndexMatch!B:B=L249),0)),\"Service Already Opened\"),\"N/A\")","v":"Service Already Opened"},0,{"$f":"IF(O249>VLOOKUP(L249,'Drop Down'!$A$3:$B$10,2,0),\"1\",\"0\")","v":"0"},0,{"$f":"SUM(Table1[[#This Row],[Case Aide Hours]],Table1[[#This Row],[Case Aide Travel Time]])","v":0},{"$f":"IFERROR(IF(OR(Table1[[#This Row],[Child Support Level]]=\"Support Services Lvl 1\", Table1[[#This Row],[Child Support Level]]=\"Support Services Lvl 2\",Table1[[#This Row],[Child Support Level]]=\"Select\"),\"Case Aid Not Allowed\", PRODUCT(Table1[[#This Row],[Total Case Aide]],VLOOKUP(Table1[[#This Row],[County Where Youth Resides]],'Drop Down'!K:M,3,0))),\"0\")","v":"Case Aid Not Allowed"},"No",0,0]
["Select","-","-","-","-","DD/MM/YYYY","DD/MM/YYYY","Select","Select",{"$f":"VLOOKUP(Table1[[#This Row],[DCYF Case Region]],'Drop Down'!$F$3:$G$9,2,0)","v":"Select"},"Select","Select","Select",{"$f":"IFERROR(IF(M250=\"No\",INDEX(IndexMatch!C:C,MATCH(1,(IndexMatch!A:A=VLOOKUP(H250,'Drop Down'!K:L,2,0))*(IndexMatch!B:B=L250),0)),\"Service Already Opened\"),\"N/A\")","v":"Service Already Opened"},0,{"$f":"IF(O250>VLOOKUP(L250,'Drop Down'!$A$3:$B$10,2,0),\"1\",\"0\")","v":"0"},0,{"$f":"SUM(Table1[[#This Row],[Case Aide Hours]],Table1[[#This Row],[Case Aide Travel Time]])","v":0},{"$f":"IFERROR(IF(OR(Table1[[#This Row],[Child Support Level]]=\"Support Services Lvl 1\", Table1[[#This Row],[Child Support Level]]=\"Support Services Lvl 2\",Table1[[#This Row],[Child Support Level]]=\"Select\"),\"Case Aid Not Allowed\", PRODUCT(Table1[[#This Row],[Total Case Aide]],VLOOKUP(Table1[[#This Row],[County Where Youth Resides]],'Drop Down'!K:M,3,0))),\"0\")","v":"Case Aid Not Allowed"},"No",0,0]
["Select","-","-","-","-","DD/MM/YYYY","DD/MM/YYYY","Select","Select",{"$f":"VLOOKUP(Table1[[#This Row],[DCYF Case Region]],'Drop Down'!$F$3:$G$9,2,0)","v":"Select"},"Select","Select","Select",{"$f":"IFERROR(IF(M251=\"No\",INDEX(IndexMatch!C:C,MATCH(1,(IndexMatch!A:A=VLOOKUP(H251,'Drop Down'!K:L,2,0))*(IndexMatch!B:B=L251),0)),\"Service Already Opened\"),\"N/A\")","v":"Service Already Opened"},0,{"$f":"IF(O251>VLOOKUP(L251,'Drop Down'!$A$3:$B$10,2,0),\"1\",\"0\")","v":"0"},0,{"$f":"SUM(Table1[[#This Row],[Case Aide Hours]],Table1[[#This Row],[Case Aide Travel Time]])","v":0},{"$f":"IFERROR(IF(OR(Table1[[#This Row],[Child Support Level]]=\"Support Services Lvl 1\", Table1[[#This Row],[Child Support Level]]=\"Support Services Lvl 2\",Table1[[#This Row],[Child Support Level]]=\"Select\"),\"Case Aid Not Allowed\", PRODUCT(Table1[[#This Row],[Total Case Aide]],VLOOKUP(Table1[[#This Row],[County Where Youth Resides]],'Drop Down'!K:M,3,0))),\"0\")","v":"Case Aid Not Allowed"},"No",0,0]
["Select","-","-","-","-","DD/MM/YYYY","DD/MM/YYYY","Select","Select",{"$f":"VLOOKUP(Table1[[#This Row],[DCYF Case Region]],'Drop Down'!$F$3:$G$9,2,0)","v":"Select"},"Select","Select","Select",{"$f":"IFERROR(IF(M252=\"No\",INDEX(IndexMatch!C:C,MATCH(1,(IndexMatch!A:A=VLOOKUP(H252,'Drop Down'!K:L,2,0))*(IndexMatch!B:B=L252),0)),\"Service Already Opened\"),\"N/A\")","v":"Service Already Opened"},0,{"$f":"IF(O252>VLOOKUP(L252,'Drop Down'!$A$3:$B$10,2,0),\"1\",\"0\")","v":"0"},0,{"$f":"SUM(Table1[[#This Row],[Case Aide Hours]],Table1[[#This Row],[Case Aide Travel Time]])","v":0},{"$f":"IFERROR(IF(OR(Table1[[#This Row],[Child Support Level]]=\"Support Services Lvl 1\", Table1[[#This Row],[Child Support Level]]=\"Support Services Lvl 2\",Table1[[#This Row],[Child Support Level]]=\"Select\"),\"Case Aid Not Allowed\", PRODUCT(Table1[[#This Row],[Total Case Aide]],VLOOKUP(Table1[[#This Row],[County Where Youth Resides]],'Drop Down'!K:M,3,0))),\"0\")","v":"Case Aid Not Allowed"},"No",0,0]
["Select","-","-","-","-","DD/MM/YYYY","DD/MM/YYYY","Select","Select",{"$f":"VLOOKUP(Table1[[#This Row],[DCYF Case Region]],'Drop Down'!$F$3:$G$9,2,0)","v":"Select"},"Select","Select","Select",{"$f":"IFERROR(IF(M253=\"No\",INDEX(IndexMatch!C:C,MATCH(1,(IndexMatch!A:A=VLOOKUP(H253,'Drop Down'!K:L,2,0))*(IndexMatch!B:B=L253),0)),\"Service Already Opened\"),\"N/A\")","v":"Service Already Opened"},0,{"$f":"IF(O253>VLOOKUP(L253,'Drop Down'!$A$3:$B$10,2,0),\"1\",\"0\")","v":"0"},0,{"$f":"SUM(Table1[[#This Row],[Case Aide Hours]],Table1[[#This Row],[Case Aide Travel Time]])","v":0},{"$f":"IFERROR(IF(OR(Table1[[#This Row],[Child Support Level]]=\"Support Services Lvl 1\", Table1[[#This Row],[Child Support Level]]=\"Support Services Lvl 2\",Table1[[#This Row],[Child Support Level]]=\"Select\"),\"Case Aid Not Allowed\", PRODUCT(Table1[[#This Row],[Total Case Aide]],VLOOKUP(Table1[[#This Row],[County Where Youth Resides]],'Drop Down'!K:M,3,0))),\"0\")","v":"Case Aid Not Allowed"},"No",0,0]
["Select","-","-","-","-","DD/MM/YYYY","DD/MM/YYYY","Select","Select",{"$f":"VLOOKUP(Table1[[#This Row],[DCYF Case Region]],'Drop Down'!$F$3:$G$9,2,0)","v":"Select"},"Select","Select","Select",{"$f":"IFERROR(IF(M254=\"No\",INDEX(IndexMatch!C:C,MATCH(1,(IndexMatch!A:A=VLOOKUP(H254,'Drop Down'!K:L,2,0))*(IndexMatch!B:B=L254),0)),\"Service Already Opened\"),\"N/A\")","v":"Service Already Opened"},0,{"$f":"IF(O254>VLOOKUP(L254,'Drop Down'!$A$3:$B$10,2,0),\"1\",\"0\")","v":"0"},0,{"$f":"SUM(Table1[[#This Row],[Case Aide Hours]],Table1[[#This Row],[Case Aide Travel Time]])","v":0},{"$f":"IFERROR(IF(OR(Table1[[#This Row],[Child Support Level]]=\"Support Services Lvl 1\", Table1[[#This Row],[Child Support Level]]=\"Support Services Lvl 2\",Table1[[#This Row],[Child Support Level]]=\"Select\"),\"Case Aid Not Allowed\", PRODUCT(Table1[[#This Row],[Total Case Aide]],VLOOKUP(Table1[[#This Row],[County Where Youth Resides]],'Drop Down'!K:M,3,0))),\"0\")","v":"Case Aid Not Allowed"},"No",0,0]
["Select","-","-","-","-","DD/MM/YYYY","DD/MM/YYYY","Select","Select",{"$f":"VLOOKUP(Table1[[#This Row],[DCYF Case Region]],'Drop Down'!$F$3:$G$9,2,0)","v":"Select"},"Select","Select","Select",{"$f":"IFERROR(IF(M255=\"No\",INDEX(IndexMatch!C:C,MATCH(1,(IndexMatch!A:A=VLOOKUP(H255,'Drop Down'!K:L,2,0))*(IndexMatch!B:B=L255),0)),\"Service Already Opened\"),\"N/A\")","v":"Service Already Opened"},0,{"$f":"IF(O255>VLOOKUP(L255,'Drop Down'!$A$3:$B$10,2,0),\"1\",\"0\")","v":"0"},0,{"$f":"SUM(Table1[[#This Row],[Case Aide Hours]],Table1[[#This Row],[Case Aide Travel Time]])","v":0},{"$f":"IFERROR(IF(OR(Table1[[#This Row],[Child Support Level]]=\"Support Services Lvl 1\", Table1[[#This Row],[Child Support Level]]=\"Support Services Lvl 2\",Table1[[#This Row],[Child Support Level]]=\"Select\"),\"Case Aid Not Allowed\", PRODUCT(Table1[[#This Row],[Total Case Aide]],VLOOKUP(Table1[[#This Row],[County Where Youth Resides]],'Drop Down'!K:M,3,0))),\"0\")","v":"Case Aid Not Allowed"},"No",0,0]
["Select","-","-","-","-","DD/MM/YYYY","DD/MM/YYYY","Select","Select",{"$f":"VLOOKUP(Table1[[#This Row],[DCYF Case Region]],'Drop Down'!$F$3:$G$9,2,0)","v":"Select"},"Select","Select","Select",{"$f":"IFERROR(IF(M256=\"No\",INDEX(IndexMatch!C:C,MATCH(1,(IndexMatch!A:A=VLOOKUP(H256,'Drop Down'!K:L,2,0))*(IndexMatch!B:B=L256),0)),\"Service Already Opened\"),\"N/A\")","v":"Service Already Opened"},0,{"$f":"IF(O256>VLOOKUP(L256,'Drop Down'!$A$3:$B$10,2,0),\"1\",\"0\")","v":"0"},0,{"$f":"SUM(Table1[[#This Row],[Case Aide Hours]],Table1[[#This Row],[Case Aide Travel Time]])","v":0},{"$f":"IFERROR(IF(OR(Table1[[#This Row],[Child Support Level]]=\"Support Services Lvl 1\", Table1[[#This Row],[Child Support Level]]=\"Support Services Lvl 2\",Table1[[#This Row],[Child Support Level]]=\"Select\"),\"Case Aid Not Allowed\", PRODUCT(Table1[[#This Row],[Total Case Aide]],VLOOKUP(Table1[[#This Row],[County Where Youth Resides]],'Drop Down'!K:M,3,0))),\"0\")","v":"Case Aid Not Allowed"},"No",0,0]
["Select","-","-","-","-","DD/MM/YYYY","DD/MM/YYYY","Select","Select",{"$f":"VLOOKUP(Table1[[#This Row],[DCYF Case Region]],'Drop Down'!$F$3:$G$9,2,0)","v":"Select"},"Select","Select","Select",{"$f":"IFERROR(IF(M257=\"No\",INDEX(IndexMatch!C:C,MATCH(1,(IndexMatch!A:A=VLOOKUP(H257,'Drop Down'!K:L,2,0))*(IndexMatch!B:B=L257),0)),\"Service Already Opened\"),\"N/A\")","v":"Service Already Opened"},0,{"$f":"IF(O257>VLOOKUP(L257,'Drop Down'!$A$3:$B$10,2,0),\"1\",\"0\")","v":"0"},0,{"$f":"SUM(Table1[[#This Row],[Case Aide Hours]],Table1[[#This Row],[Case Aide Travel Time]])","v":0},{"$f":"IFERROR(IF(OR(Table1[[#This Row],[Child Support Level]]=\"Support Services Lvl 1\", Table1[[#This Row],[Child Support Level]]=\"Support Services Lvl 2\",Table1[[#This Row],[Child Support Level]]=\"Select\"),\"Case Aid Not Allowed\", PRODUCT(Table1[[#This Row],[Total Case Aide]],VLOOKUP(Table1[[#This Row],[County Where Youth Resides]],'Drop Down'!K:M,3,0))),\"0\")","v":"Case Aid Not Allowed"},"No",0,0]
["Select","-","-","-","-","DD/MM/YYYY","DD/MM/YYYY","Select","Select",{"$f":"VLOOKUP(Table1[[#This Row],[DCYF Case Region]],'Drop Down'!$F$3:$G$9,2,0)","v":"Select"},"Select","Select","Select",{"$f":"IFERROR(IF(M258=\"No\",INDEX(IndexMatch!C:C,MATCH(1,(IndexMatch!A:A=VLOOKUP(H258,'Drop Down'!K:L,2,0))*(IndexMatch!B:B=L258),0)),\"Service Already Opened\"),\"N/A\")","v":"Service Already Opened"},0,{"$f":"IF(O258>VLOOKUP(L258,'Drop Down'!$A$3:$B$10,2,0),\"1\",\"0\")","v":"0"},0,{"$f":"SUM(Table1[[#This Row],[Case Aide Hours]],Table1[[#This Row],[Case Aide Travel Time]])","v":0},{"$f":"IFERROR(IF(OR(Table1[[#This Row],[Child Support Level]]=\"Support Services Lvl 1\", Table1[[#This Row],[Child Support Level]]=\"Support Services Lvl 2\",Table1[[#This Row],[Child Support Level]]=\"Select\"),\"Case Aid Not Allowed\", PRODUCT(Table1[[#This Row],[Total Case Aide]],VLOOKUP(Table1[[#This Row],[County Where Youth Resides]],'Drop Down'!K:M,3,0))),\"0\")","v":"Case Aid Not Allowed"},"No",0,{"$f":"ROUND(PRODUCT(U258,0.67),2)","v":0}]
["Select","-","-","-","-","DD/MM/YYYY","DD/MM/YYYY","Select","Select",{"$f":"VLOOKUP(Table1[[#This Row],[DCYF Case Region]],'Drop Down'!$F$3:$G$9,2,0)","v":"Select"},"Select","Select","Select",{"$f":"IFERROR(IF(M259=\"No\",INDEX(IndexMatch!C:C,MATCH(1,(IndexMatch!A:A=VLOOKUP(H259,'Drop Down'!K:L,2,0))*(IndexMatch!B:B=L259),0)),\"Service Already Opened\"),\"N/A\")","v":"Service Already Opened"},0,{"$f":"IF(O259>VLOOKUP(L259,'Drop Down'!$A$3:$B$10,2,0),\"1\",\"0\")","v":"0"},0,{"$f":"SUM(Table1[[#This Row],[Case Aide Hours]],Table1[[#This Row],[Case Aide Travel Time]])","v":0},{"$f":"IFERROR(IF(OR(Table1[[#This Row],[Child Support Level]]=\"Support Services Lvl 1\", Table1[[#This Row],[Child Support Level]]=\"Support Services Lvl 2\",Table1[[#This Row],[Child Support Level]]=\"Select\"),\"Case Aid Not Allowed\", PRODUCT(Table1[[#This Row],[Total Case Aide]],VLOOKUP(Table1[[#This Row],[County Where Youth Resides]],'Drop Down'!K:M,3,0))),\"0\")","v":"Case Aid Not Allowed"},{"$f":"IF(P259=\"1\",\"Yes\",\"No\")","v":"No"},0,0]
["Select","-","-","-","-","DD/MM/YYYY","DD/MM/YYYY","Select","Select",{"$f":"VLOOKUP(Table1[[#This Row],[DCYF Case Region]],'Drop Down'!$F$3:$G$9,2,0)","v":"Select"},"Select","Select","Select",{"$f":"IFERROR(IF(M260=\"No\",INDEX(IndexMatch!C:C,MATCH(1,(IndexMatch!A:A=VLOOKUP(H260,'Drop Down'!K:L,2,0))*(IndexMatch!B:B=L260),0)),\"Service Already Opened\"),\"N/A\")","v":"Service Already Opened"},0,{"$f":"IF(O260>VLOOKUP(L260,'Drop Down'!$A$3:$B$10,2,0),\"1\",\"0\")","v":"0"},0,{"$f":"SUM(Table1[[#This Row],[Case Aide Hours]],Table1[[#This Row],[Case Aide Travel Time]])","v":0},{"$f":"IFERROR(IF(OR(Table1[[#This Row],[Child Support Level]]=\"Support Services Lvl 1\", Table1[[#This Row],[Child Support Level]]=\"Support Services Lvl 2\",Table1[[#This Row],[Child Support Level]]=\"Select\"),\"Case Aid Not Allowed\", PRODUCT(Table1[[#This Row],[Total Case Aide]],VLOOKUP(Table1[[#This Row],[County Where Youth Resides]],'Drop Down'!K:M,3,0))),\"0\")","v":"Case Aid Not Allowed"},"No",0,0]
["Select","-","-","-","-","DD/MM/YYYY","DD/MM/YYYY","Select","Select",{"$f":"VLOOKUP(Table1[[#This Row],[DCYF Case Region]],'Drop Down'!$F$3:$G$9,2,0)","v":"Select"},"Select","Select","Select",{"$f":"IFERROR(IF(M261=\"No\",INDEX(IndexMatch!C:C,MATCH(1,(IndexMatch!A:A=VLOOKUP(H261,'Drop Down'!K:L,2,0))*(IndexMatch!B:B=L261),0)),\"Service Already Opened\"),\"N/A\")","v":"Service Already Opened"},0,{"$f":"IF(O261>VLOOKUP(L261,'Drop Down'!$A$3:$B$10,2,0),\"1\",\"0\")","v":"0"},0,{"$f":"SUM(Table1[[#This Row],[Case Aide Hours]],Table1[[#This Row],[Case Aide Travel Time]])","v":0},{"$f":"IFERROR(IF(OR(Table1[[#This Row],[Child Support Level]]=\"Support Services Lvl 1\", Table1[[#This Row],[Child Support Level]]=\"Support Services Lvl 2\",Table1[[#This Row],[Child Support Level]]=\"Select\"),\"Case Aid Not Allowed\", PRODUCT(Table1[[#This Row],[Total Case Aide]],VLOOKUP(Table1[[#This Row],[County Where Youth Resides]],'Drop Down'!K:M,3,0))),\"0\")","v":"Case Aid Not Allowed"},"No",0,0]
["Select","-","-","-","-","DD/MM/YYYY","DD/MM/YYYY","Select","Select",{"$f":"VLOOKUP(Table1[[#This Row],[DCYF Case Region]],'Drop Down'!$F$3:$G$9,2,0)","v":"Select"},"Select","Select","Select",{"$f":"IFERROR(IF(M262=\"No\",INDEX(IndexMatch!C:C,MATCH(1,(IndexMatch!A:A=VLOOKUP(H262,'Drop Down'!K:L,2,0))*(IndexMatch!B:B=L262),0)),\"Service Already Opened\"),\"N/A\")","v":"Service Already Opened"},0,{"$f":"IF(O262>VLOOKUP(L262,'Drop Down'!$A$3:$B$10,2,0),\"1\",\"0\")","v":"0"},0,{"$f":"SUM(Table1[[#This Row],[Case Aide Hours]],Table1[[#This Row],[Case Aide Travel Time]])","v":0},{"$f":"IFERROR(IF(OR(Table1[[#This Row],[Child Support Level]]=\"Support Services Lvl 1\", Table1[[#This Row],[Child Support Level]]=\"Support Services Lvl 2\",Table1[[#This Row],[Child Support Level]]=\"Select\"),\"Case Aid Not Allowed\", PRODUCT(Table1[[#This Row],[Total Case Aide]],VLOOKUP(Table1[[#This Row],[County Where Youth Resides]],'Drop Down'!K:M,3,0))),\"0\")","v":"Case Aid Not Allowed"},"No",0,0]
["Select","-","-","-","-","DD/MM/YYYY","DD/MM/YYYY","Select","Select",{"$f":"VLOOKUP(Table1[[#This Row],[DCYF Case Region]],'Drop Down'!$F$3:$G$9,2,0)","v":"Select"},"Select","Select","Select",{"$f":"IFERROR(IF(M263=\"No\",INDEX(IndexMatch!C:C,MATCH(1,(IndexMatch!A:A=VLOOKUP(H263,'Drop Down'!K:L,2,0))*(IndexMatch!B:B=L263),0)),\"Service Already Opened\"),\"N/A\")","v":"Service Already Opened"},0,{"$f":"IF(O263>VLOOKUP(L263,'Drop Down'!$A$3:$B$10,2,0),\"1\",\"0\")","v":"0"},0,{"$f":"SUM(Table1[[#This Row],[Case Aide Hours]],Table1[[#This Row],[Case Aide Travel Time]])","v":0},{"$f":"IFERROR(IF(OR(Table1[[#This Row],[Child Support Level]]=\"Support Services Lvl 1\", Table1[[#This Row],[Child Support Level]]=\"Support Services Lvl 2\",Table1[[#This Row],[Child Support Level]]=\"Select\"),\"Case Aid Not Allowed\", PRODUCT(Table1[[#This Row],[Total Case Aide]],VLOOKUP(Table1[[#This Row],[County Where Youth Resides]],'Drop Down'!K:M,3,0))),\"0\")","v":"Case Aid Not Allowed"},"No",0,0]
["Select","-","-","-","-","DD/MM/YYYY","DD/MM/YYYY","Select","Select",{"$f":"VLOOKUP(Table1[[#This Row],[DCYF Case Region]],'Drop Down'!$F$3:$G$9,2,0)","v":"Select"},"Select","Select","Select",{"$f":"IFERROR(IF(M264=\"No\",INDEX(IndexMatch!C:C,MATCH(1,(IndexMatch!A:A=VLOOKUP(H264,'Drop Down'!K:L,2,0))*(IndexMatch!B:B=L264),0)),\"Service Already Opened\"),\"N/A\")","v":"Service Already Opened"},0,{"$f":"IF(O264>VLOOKUP(L264,'Drop Down'!$A$3:$B$10,2,0),\"1\",\"0\")","v":"0"},0,{"$f":"SUM(Table1[[#This Row],[Case Aide Hours]],Table1[[#This Row],[Case Aide Travel Time]])","v":0},{"$f":"IFERROR(IF(OR(Table1[[#This Row],[Child Support Level]]=\"Support Services Lvl 1\", Table1[[#This Row],[Child Support Level]]=\"Support Services Lvl 2\",Table1[[#This Row],[Child Support Level]]=\"Select\"),\"Case Aid Not Allowed\", PRODUCT(Table1[[#This Row],[Total Case Aide]],VLOOKUP(Table1[[#This Row],[County Where Youth Resides]],'Drop Down'!K:M,3,0))),\"0\")","v":"Case Aid Not Allowed"},"No",0,0]
["Select","-","-","-","-","DD/MM/YYYY","DD/MM/YYYY","Select","Select",{"$f":"VLOOKUP(Table1[[#This Row],[DCYF Case Region]],'Drop Down'!$F$3:$G$9,2,0)","v":"Select"},"Select","Select","Select",{"$f":"IFERROR(IF(M265=\"No\",INDEX(IndexMatch!C:C,MATCH(1,(IndexMatch!A:A=VLOOKUP(H265,'Drop Down'!K:L,2,0))*(IndexMatch!B:B=L265),0)),\"Service Already Opened\"),\"N/A\")","v":"Service Already Opened"},0,{"$f":"IF(O265>VLOOKUP(L265,'Drop Down'!$A$3:$B$10,2,0),\"1\",\"0\")","v":"0"},0,{"$f":"SUM(Table1[[#This Row],[Case Aide Hours]],Table1[[#This Row],[Case Aide Travel Time]])","v":0},{"$f":"IFERROR(IF(OR(Table1[[#This Row],[Child Support Level]]=\"Support Services Lvl 1\", Table1[[#This Row],[Child Support Level]]=\"Support Services Lvl 2\",Table1[[#This Row],[Child Support Level]]=\"Select\"),\"Case Aid Not Allowed\", PRODUCT(Table1[[#This Row],[Total Case Aide]],VLOOKUP(Table1[[#This Row],[County Where Youth Resides]],'Drop Down'!K:M,3,0))),\"0\")","v":"Case Aid Not Allowed"},"No",0,0]
["Select","-","-","-","-","DD/MM/YYYY","DD/MM/YYYY","Select","Select",{"$f":"VLOOKUP(Table1[[#This Row],[DCYF Case Region]],'Drop Down'!$F$3:$G$9,2,0)","v":"Select"},"Select","Select","Select",{"$f":"IFERROR(IF(M266=\"No\",INDEX(IndexMatch!C:C,MATCH(1,(IndexMatch!A:A=VLOOKUP(H266,'Drop Down'!K:L,2,0))*(IndexMatch!B:B=L266),0)),\"Service Already Opened\"),\"N/A\")","v":"Service Already Opened"},0,{"$f":"IF(O266>VLOOKUP(L266,'Drop Down'!$A$3:$B$10,2,0),\"1\",\"0\")","v":"0"},0,{"$f":"SUM(Table1[[#This Row],[Case Aide Hours]],Table1[[#This Row],[Case Aide Travel Time]])","v":0},{"$f":"IFERROR(IF(OR(Table1[[#This Row],[Child Support Level]]=\"Support Services Lvl 1\", Table1[[#This Row],[Child Support Level]]=\"Support Services Lvl 2\",Table1[[#This Row],[Child Support Level]]=\"Select\"),\"Case Aid Not Allowed\", PRODUCT(Table1[[#This Row],[Total Case Aide]],VLOOKUP(Table1[[#This Row],[County Where Youth Resides]],'Drop Down'!K:M,3,0))),\"0\")","v":"Case Aid Not Allowed"},"No",0,0]
["Select","-","-","-","-","DD/MM/YYYY","DD/MM/YYYY","Select","Select",{"$f":"VLOOKUP(Table1[[#This Row],[DCYF Case Region]],'Drop Down'!$F$3:$G$9,2,0)","v":"Select"},"Select","Select","Select",{"$f":"IFERROR(IF(M267=\"No\",INDEX(IndexMatch!C:C,MATCH(1,(IndexMatch!A:A=VLOOKUP(H267,'Drop Down'!K:L,2,0))*(IndexMatch!B:B=L267),0)),\"Service Already Opened\"),\"N/A\")","v":"Service Already Opened"},0,{"$f":"IF(O267>VLOOKUP(L267,'Drop Down'!$A$3:$B$10,2,0),\"1\",\"0\")","v":"0"},0,{"$f":"SUM(Table1[[#This Row],[Case Aide Hours]],Table1[[#This Row],[Case Aide Travel Time]])","v":0},{"$f":"IFERROR(IF(OR(Table1[[#This Row],[Child Support Level]]=\"Support Services Lvl 1\", Table1[[#This Row],[Child Support Level]]=\"Support Services Lvl 2\",Table1[[#This Row],[Child Support Level]]=\"Select\"),\"Case Aid Not Allowed\", PRODUCT(Table1[[#This Row],[Total Case Aide]],VLOOKUP(Table1[[#This Row],[County Where Youth Resides]],'Drop Down'!K:M,3,0))),\"0\")","v":"Case Aid Not Allowed"},"No",0,0]
["Select","-","-","-","-","DD/MM/YYYY","DD/MM/YYYY","Select","Select",{"$f":"VLOOKUP(Table1[[#This Row],[DCYF Case Region]],'Drop Down'!$F$3:$G$9,2,0)","v":"Select"},"Select","Select","Select",{"$f":"IFERROR(IF(M268=\"No\",INDEX(IndexMatch!C:C,MATCH(1,(IndexMatch!A:A=VLOOKUP(H268,'Drop Down'!K:L,2,0))*(IndexMatch!B:B=L268),0)),\"Service Already Opened\"),\"N/A\")","v":"Service Already Opened"},0,{"$f":"IF(O268>VLOOKUP(L268,'Drop Down'!$A$3:$B$10,2,0),\"1\",\"0\")","v":"0"},0,{"$f":"SUM(Table1[[#This Row],[Case Aide Hours]],Table1[[#This Row],[Case Aide Travel Time]])","v":0},{"$f":"IFERROR(IF(OR(Table1[[#This Row],[Child Support Level]]=\"Support Services Lvl 1\", Table1[[#This Row],[Child Support Level]]=\"Support Services Lvl 2\",Table1[[#This Row],[Child Support Level]]=\"Select\"),\"Case Aid Not Allowed\", PRODUCT(Table1[[#This Row],[Total Case Aide]],VLOOKUP(Table1[[#This Row],[County Where Youth Resides]],'Drop Down'!K:M,3,0))),\"0\")","v":"Case Aid Not Allowed"},"No",0,0]
["Select","-","-","-","-","DD/MM/YYYY","DD/MM/YYYY","Select","Select",{"$f":"VLOOKUP(Table1[[#This Row],[DCYF Case Region]],'Drop Down'!$F$3:$G$9,2,0)","v":"Select"},"Select","Select","Select",{"$f":"IFERROR(IF(M269=\"No\",INDEX(IndexMatch!C:C,MATCH(1,(IndexMatch!A:A=VLOOKUP(H269,'Drop Down'!K:L,2,0))*(IndexMatch!B:B=L269),0)),\"Service Already Opened\"),\"N/A\")","v":"Service Already Opened"},0,{"$f":"IF(O269>VLOOKUP(L269,'Drop Down'!$A$3:$B$10,2,0),\"1\",\"0\")","v":"0"},0,{"$f":"SUM(Table1[[#This Row],[Case Aide Hours]],Table1[[#This Row],[Case Aide Travel Time]])","v":0},{"$f":"IFERROR(IF(OR(Table1[[#This Row],[Child Support Level]]=\"Support Services Lvl 1\", Table1[[#This Row],[Child Support Level]]=\"Support Services Lvl 2\",Table1[[#This Row],[Child Support Level]]=\"Select\"),\"Case Aid Not Allowed\", PRODUCT(Table1[[#This Row],[Total Case Aide]],VLOOKUP(Table1[[#This Row],[County Where Youth Resides]],'Drop Down'!K:M,3,0))),\"0\")","v":"Case Aid Not Allowed"},"No",0,0]
["Select","-","-","-","-","DD/MM/YYYY","DD/MM/YYYY","Select","Select",{"$f":"VLOOKUP(Table1[[#This Row],[DCYF Case Region]],'Drop Down'!$F$3:$G$9,2,0)","v":"Select"},"Select","Select","Select",{"$f":"IFERROR(IF(M270=\"No\",INDEX(IndexMatch!C:C,MATCH(1,(IndexMatch!A:A=VLOOKUP(H270,'Drop Down'!K:L,2,0))*(IndexMatch!B:B=L270),0)),\"Service Already Opened\"),\"N/A\")","v":"Service Already Opened"},0,{"$f":"IF(O270>VLOOKUP(L270,'Drop Down'!$A$3:$B$10,2,0),\"1\",\"0\")","v":"0"},0,{"$f":"SUM(Table1[[#This Row],[Case Aide Hours]],Table1[[#This Row],[Case Aide Travel Time]])","v":0},{"$f":"IFERROR(IF(OR(Table1[[#This Row],[Child Support Level]]=\"Support Services Lvl 1\", Table1[[#This Row],[Child Support Level]]=\"Support Services Lvl 2\",Table1[[#This Row],[Child Support Level]]=\"Select\"),\"Case Aid Not Allowed\", PRODUCT(Table1[[#This Row],[Total Case Aide]],VLOOKUP(Table1[[#This Row],[County Where Youth Resides]],'Drop Down'!K:M,3,0))),\"0\")","v":"Case Aid Not Allowed"},"No",0,0]
["Select","-","-","-","-","DD/MM/YYYY","DD/MM/YYYY","Select","Select",{"$f":"VLOOKUP(Table1[[#This Row],[DCYF Case Region]],'Drop Down'!$F$3:$G$9,2,0)","v":"Select"},"Select","Select","Select",{"$f":"IFERROR(IF(M271=\"No\",INDEX(IndexMatch!C:C,MATCH(1,(IndexMatch!A:A=VLOOKUP(H271,'Drop Down'!K:L,2,0))*(IndexMatch!B:B=L271),0)),\"Service Already Opened\"),\"N/A\")","v":"Service Already Opened"},0,{"$f":"IF(O271>VLOOKUP(L271,'Drop Down'!$A$3:$B$10,2,0),\"1\",\"0\")","v":"0"},0,{"$f":"SUM(Table1[[#This Row],[Case Aide Hours]],Table1[[#This Row],[Case Aide Travel Time]])","v":0},{"$f":"IFERROR(IF(OR(Table1[[#This Row],[Child Support Level]]=\"Support Services Lvl 1\", Table1[[#This Row],[Child Support Level]]=\"Support Services Lvl 2\",Table1[[#This Row],[Child Support Level]]=\"Select\"),\"Case Aid Not Allowed\", PRODUCT(Table1[[#This Row],[Total Case Aide]],VLOOKUP(Table1[[#This Row],[County Where Youth Resides]],'Drop Down'!K:M,3,0))),\"0\")","v":"Case Aid Not Allowed"},"No",0,0]
["Select","-","-","-","-","DD/MM/YYYY","DD/MM/YYYY","Select","Select",{"$f":"VLOOKUP(Table1[[#This Row],[DCYF Case Region]],'Drop Down'!$F$3:$G$9,2,0)","v":"Select"},"Select","Select","Select",{"$f":"IFERROR(IF(M272=\"No\",INDEX(IndexMatch!C:C,MATCH(1,(IndexMatch!A:A=VLOOKUP(H272,'Drop Down'!K:L,2,0))*(IndexMatch!B:B=L272),0)),\"Service Already Opened\"),\"N/A\")","v":"Service Already Opened"},0,{"$f":"IF(O272>VLOOKUP(L272,'Drop Down'!$A$3:$B$10,2,0),\"1\",\"0\")","v":"0"},0,{"$f":"SUM(Table1[[#This Row],[Case Aide Hours]],Table1[[#This Row],[Case Aide Travel Time]])","v":0},{"$f":"IFERROR(IF(OR(Table1[[#This Row],[Child Support Level]]=\"Support Services Lvl 1\", Table1[[#This Row],[Child Support Level]]=\"Support Services Lvl 2\",Table1[[#This Row],[Child Support Level]]=\"Select\"),\"Case Aid Not Allowed\", PRODUCT(Table1[[#This Row],[Total Case Aide]],VLOOKUP(Table1[[#This Row],[County Where Youth Resides]],'Drop Down'!K:M,3,0))),\"0\")","v":"Case Aid Not Allowed"},"No",0,0]
["Select","-","-","-","-","DD/MM/YYYY","DD/MM/YYYY","Select","Select",{"$f":"VLOOKUP(Table1[[#This Row],[DCYF Case Region]],'Drop Down'!$F$3:$G$9,2,0)","v":"Select"},"Select","Select","Select",{"$f":"IFERROR(IF(M273=\"No\",INDEX(IndexMatch!C:C,MATCH(1,(IndexMatch!A:A=VLOOKUP(H273,'Drop Down'!K:L,2,0))*(IndexMatch!B:B=L273),0)),\"Service Already Opened\"),\"N/A\")","v":"Service Already Opened"},0,{"$f":"IF(O273>VLOOKUP(L273,'Drop Down'!$A$3:$B$10,2,0),\"1\",\"0\")","v":"0"},0,{"$f":"SUM(Table1[[#This Row],[Case Aide Hours]],Table1[[#This Row],[Case Aide Travel Time]])","v":0},{"$f":"IFERROR(IF(OR(Table1[[#This Row],[Child Support Level]]=\"Support Services Lvl 1\", Table1[[#This Row],[Child Support Level]]=\"Support Services Lvl 2\",Table1[[#This Row],[Child Support Level]]=\"Select\"),\"Case Aid Not Allowed\", PRODUCT(Table1[[#This Row],[Total Case Aide]],VLOOKUP(Table1[[#This Row],[County Where Youth Resides]],'Drop Down'!K:M,3,0))),\"0\")","v":"Case Aid Not Allowed"},"No",0,0]
["Select","-","-","-","-","DD/MM/YYYY","DD/MM/YYYY","Select","Select",{"$f":"VLOOKUP(Table1[[#This Row],[DCYF Case Region]],'Drop Down'!$F$3:$G$9,2,0)","v":"Select"},"Select","Select","Select",{"$f":"IFERROR(IF(M274=\"No\",INDEX(IndexMatch!C:C,MATCH(1,(IndexMatch!A:A=VLOOKUP(H274,'Drop Down'!K:L,2,0))*(IndexMatch!B:B=L274),0)),\"Service Already Opened\"),\"N/A\")","v":"Service Already Opened"},0,{"$f":"IF(O274>VLOOKUP(L274,'Drop Down'!$A$3:$B$10,2,0),\"1\",\"0\")","v":"0"},0,{"$f":"SUM(Table1[[#This Row],[Case Aide Hours]],Table1[[#This Row],[Case Aide Travel Time]])","v":0},{"$f":"IFERROR(IF(OR(Table1[[#This Row],[Child Support Level]]=\"Support Services Lvl 1\", Table1[[#This Row],[Child Support Level]]=\"Support Services Lvl 2\",Table1[[#This Row],[Child Support Level]]=\"Select\"),\"Case Aid Not Allowed\", PRODUCT(Table1[[#This Row],[Total Case Aide]],VLOOKUP(Table1[[#This Row],[County Where Youth Resides]],'Drop Down'!K:M,3,0))),\"0\")","v":"Case Aid Not Allowed"},"No",0,0]
["Select","-","-","-","-","DD/MM/YYYY","DD/MM/YYYY","Select","Select",{"$f":"VLOOKUP(Table1[[#This Row],[DCYF Case Region]],'Drop Down'!$F$3:$G$9,2,0)","v":"Select"},"Select","Select","Select",{"$f":"IFERROR(IF(M275=\"No\",INDEX(IndexMatch!C:C,MATCH(1,(IndexMatch!A:A=VLOOKUP(H275,'Drop Down'!K:L,2,0))*(IndexMatch!B:B=L275),0)),\"Service Already Opened\"),\"N/A\")","v":"Service Already Opened"},0,{"$f":"IF(O275>VLOOKUP(L275,'Drop Down'!$A$3:$B$10,2,0),\"1\",\"0\")","v":"0"},0,{"$f":"SUM(Table1[[#This Row],[Case Aide Hours]],Table1[[#This Row],[Case Aide Travel Time]])","v":0},{"$f":"IFERROR(IF(OR(Table1[[#This Row],[Child Support Level]]=\"Support Services Lvl 1\", Table1[[#This Row],[Child Support Level]]=\"Support Services Lvl 2\",Table1[[#This Row],[Child Support Level]]=\"Select\"),\"Case Aid Not Allowed\", PRODUCT(Table1[[#This Row],[Total Case Aide]],VLOOKUP(Table1[[#This Row],[County Where Youth Resides]],'Drop Down'!K:M,3,0))),\"0\")","v":"Case Aid Not Allowed"},"No",0,0]
["Select","-","-","-","-","DD/MM/YYYY","DD/MM/YYYY","Select","Select",{"$f":"VLOOKUP(Table1[[#This Row],[DCYF Case Region]],'Drop Down'!$F$3:$G$9,2,0)","v":"Select"},"Select","Select","Select",{"$f":"IFERROR(IF(M276=\"No\",INDEX(IndexMatch!C:C,MATCH(1,(IndexMatch!A:A=VLOOKUP(H276,'Drop Down'!K:L,2,0))*(IndexMatch!B:B=L276),0)),\"Service Already Opened\"),\"N/A\")","v":"Service Already Opened"},0,{"$f":"IF(O276>VLOOKUP(L276,'Drop Down'!$A$3:$B$10,2,0),\"1\",\"0\")","v":"0"},0,{"$f":"SUM(Table1[[#This Row],[Case Aide Hours]],Table1[[#This Row],[Case Aide Travel Time]])","v":0},{"$f":"IFERROR(IF(OR(Table1[[#This Row],[Child Support Level]]=\"Support Services Lvl 1\", Table1[[#This Row],[Child Support Level]]=\"Support Services Lvl 2\",Table1[[#This Row],[Child Support Level]]=\"Select\"),\"Case Aid Not Allowed\", PRODUCT(Table1[[#This Row],[Total Case Aide]],VLOOKUP(Table1[[#This Row],[County Where Youth Resides]],'Drop Down'!K:M,3,0))),\"0\")","v":"Case Aid Not Allowed"},"No",0,0]
["Select","-","-","-","-","DD/MM/YYYY","DD/MM/YYYY","Select","Select",{"$f":"VLOOKUP(Table1[[#This Row],[DCYF Case Region]],'Drop Down'!$F$3:$G$9,2,0)","v":"Select"},"Select","Select","Select",{"$f":"IFERROR(IF(M277=\"No\",INDEX(IndexMatch!C:C,MATCH(1,(IndexMatch!A:A=VLOOKUP(H277,'Drop Down'!K:L,2,0))*(IndexMatch!B:B=L277),0)),\"Service Already Opened\"),\"N/A\")","v":"Service Already Opened"},0,{"$f":"IF(O277>VLOOKUP(L277,'Drop Down'!$A$3:$B$10,2,0),\"1\",\"0\")","v":"0"},0,{"$f":"SUM(Table1[[#This Row],[Case Aide Hours]],Table1[[#This Row],[Case Aide Travel Time]])","v":0},{"$f":"IFERROR(IF(OR(Table1[[#This Row],[Child Support Level]]=\"Support Services Lvl 1\", Table1[[#This Row],[Child Support Level]]=\"Support Services Lvl 2\",Table1[[#This Row],[Child Support Level]]=\"Select\"),\"Case Aid Not Allowed\", PRODUCT(Table1[[#This Row],[Total Case Aide]],VLOOKUP(Table1[[#This Row],[County Where Youth Resides]],'Drop Down'!K:M,3,0))),\"0\")","v":"Case Aid Not Allowed"},"No",0,0]
["Select","-","-","-","-","DD/MM/YYYY","DD/MM/YYYY","Select","Select",{"$f":"VLOOKUP(Table1[[#This Row],[DCYF Case Region]],'Drop Down'!$F$3:$G$9,2,0)","v":"Select"},"Select","Select","Select",{"$f":"IFERROR(IF(M278=\"No\",INDEX(IndexMatch!C:C,MATCH(1,(IndexMatch!A:A=VLOOKUP(H278,'Drop Down'!K:L,2,0))*(IndexMatch!B:B=L278),0)),\"Service Already Opened\"),\"N/A\")","v":"Service Already Opened"},0,{"$f":"IF(O278>VLOOKUP(L278,'Drop Down'!$A$3:$B$10,2,0),\"1\",\"0\")","v":"0"},0,{"$f":"SUM(Table1[[#This Row],[Case Aide Hours]],Table1[[#This Row],[Case Aide Travel Time]])","v":0},{"$f":"IFERROR(IF(OR(Table1[[#This Row],[Child Support Level]]=\"Support Services Lvl 1\", Table1[[#This Row],[Child Support Level]]=\"Support Services Lvl 2\",Table1[[#This Row],[Child Support Level]]=\"Select\"),\"Case Aid Not Allowed\", PRODUCT(Table1[[#This Row],[Total Case Aide]],VLOOKUP(Table1[[#This Row],[County Where Youth Resides]],'Drop Down'!K:M,3,0))),\"0\")","v":"Case Aid Not Allowed"},"No",0,0]
["Select","-","-","-","-","DD/MM/YYYY","DD/MM/YYYY","Select","Select",{"$f":"VLOOKUP(Table1[[#This Row],[DCYF Case Region]],'Drop Down'!$F$3:$G$9,2,0)","v":"Select"},"Select","Select","Select",{"$f":"IFERROR(IF(M279=\"No\",INDEX(IndexMatch!C:C,MATCH(1,(IndexMatch!A:A=VLOOKUP(H279,'Drop Down'!K:L,2,0))*(IndexMatch!B:B=L279),0)),\"Service Already Opened\"),\"N/A\")","v":"Service Already Opened"},0,{"$f":"IF(O279>VLOOKUP(L279,'Drop Down'!$A$3:$B$10,2,0),\"1\",\"0\")","v":"0"},0,{"$f":"SUM(Table1[[#This Row],[Case Aide Hours]],Table1[[#This Row],[Case Aide Travel Time]])","v":0},{"$f":"IFERROR(IF(OR(Table1[[#This Row],[Child Support Level]]=\"Support Services Lvl 1\", Table1[[#This Row],[Child Support Level]]=\"Support Services Lvl 2\",Table1[[#This Row],[Child Support Level]]=\"Select\"),\"Case Aid Not Allowed\", PRODUCT(Table1[[#This Row],[Total Case Aide]],VLOOKUP(Table1[[#This Row],[County Where Youth Resides]],'Drop Down'!K:M,3,0))),\"0\")","v":"Case Aid Not Allowed"},"No",0,0]
["Select","-","-","-","-","DD/MM/YYYY","DD/MM/YYYY","Select","Select",{"$f":"VLOOKUP(Table1[[#This Row],[DCYF Case Region]],'Drop Down'!$F$3:$G$9,2,0)","v":"Select"},"Select","Select","Select",{"$f":"IFERROR(IF(M280=\"No\",INDEX(IndexMatch!C:C,MATCH(1,(IndexMatch!A:A=VLOOKUP(H280,'Drop Down'!K:L,2,0))*(IndexMatch!B:B=L280),0)),\"Service Already Opened\"),\"N/A\")","v":"Service Already Opened"},0,{"$f":"IF(O280>VLOOKUP(L280,'Drop Down'!$A$3:$B$10,2,0),\"1\",\"0\")","v":"0"},0,{"$f":"SUM(Table1[[#This Row],[Case Aide Hours]],Table1[[#This Row],[Case Aide Travel Time]])","v":0},{"$f":"IFERROR(IF(OR(Table1[[#This Row],[Child Support Level]]=\"Support Services Lvl 1\", Table1[[#This Row],[Child Support Level]]=\"Support Services Lvl 2\",Table1[[#This Row],[Child Support Level]]=\"Select\"),\"Case Aid Not Allowed\", PRODUCT(Table1[[#This Row],[Total Case Aide]],VLOOKUP(Table1[[#This Row],[County Where Youth Resides]],'Drop Down'!K:M,3,0))),\"0\")","v":"Case Aid Not Allowed"},"No",0,0]
["Select","-","-","-","-","DD/MM/YYYY","DD/MM/YYYY","Select","Select",{"$f":"VLOOKUP(Table1[[#This Row],[DCYF Case Region]],'Drop Down'!$F$3:$G$9,2,0)","v":"Select"},"Select","Select","Select",{"$f":"IFERROR(IF(M281=\"No\",INDEX(IndexMatch!C:C,MATCH(1,(IndexMatch!A:A=VLOOKUP(H281,'Drop Down'!K:L,2,0))*(IndexMatch!B:B=L281),0)),\"Service Already Opened\"),\"N/A\")","v":"Service Already Opened"},0,{"$f":"IF(O281>VLOOKUP(L281,'Drop Down'!$A$3:$B$10,2,0),\"1\",\"0\")","v":"0"},0,{"$f":"SUM(Table1[[#This Row],[Case Aide Hours]],Table1[[#This Row],[Case Aide Travel Time]])","v":0},{"$f":"IFERROR(IF(OR(Table1[[#This Row],[Child Support Level]]=\"Support Services Lvl 1\", Table1[[#This Row],[Child Support Level]]=\"Support Services Lvl 2\",Table1[[#This Row],[Child Support Level]]=\"Select\"),\"Case Aid Not Allowed\", PRODUCT(Table1[[#This Row],[Total Case Aide]],VLOOKUP(Table1[[#This Row],[County Where Youth Resides]],'Drop Down'!K:M,3,0))),\"0\")","v":"Case Aid Not Allowed"},"No",0,0]
["Select","-","-","-","-","DD/MM/YYYY","DD/MM/YYYY","Select","Select",{"$f":"VLOOKUP(Table1[[#This Row],[DCYF Case Region]],'Drop Down'!$F$3:$G$9,2,0)","v":"Select"},"Select","Select","Select",{"$f":"IFERROR(IF(M282=\"No\",INDEX(IndexMatch!C:C,MATCH(1,(IndexMatch!A:A=VLOOKUP(H282,'Drop Down'!K:L,2,0))*(IndexMatch!B:B=L282),0)),\"Service Already Opened\"),\"N/A\")","v":"Service Already Opened"},0,{"$f":"IF(O282>VLOOKUP(L282,'Drop Down'!$A$3:$B$10,2,0),\"1\",\"0\")","v":"0"},0,{"$f":"SUM(Table1[[#This Row],[Case Aide Hours]],Table1[[#This Row],[Case Aide Travel Time]])","v":0},{"$f":"IFERROR(IF(OR(Table1[[#This Row],[Child Support Level]]=\"Support Services Lvl 1\", Table1[[#This Row],[Child Support Level]]=\"Support Services Lvl 2\",Table1[[#This Row],[Child Support Level]]=\"Select\"),\"Case Aid Not Allowed\", PRODUCT(Table1[[#This Row],[Total Case Aide]],VLOOKUP(Table1[[#This Row],[County Where Youth Resides]],'Drop Down'!K:M,3,0))),\"0\")","v":"Case Aid Not Allowed"},"No",0,0]
["Select","-","-","-","-","DD/MM/YYYY","DD/MM/YYYY","Select","Select",{"$f":"VLOOKUP(Table1[[#This Row],[DCYF Case Region]],'Drop Down'!$F$3:$G$9,2,0)","v":"Select"},"Select","Select","Select",{"$f":"IFERROR(IF(M283=\"No\",INDEX(IndexMatch!C:C,MATCH(1,(IndexMatch!A:A=VLOOKUP(H283,'Drop Down'!K:L,2,0))*(IndexMatch!B:B=L283),0)),\"Service Already Opened\"),\"N/A\")","v":"Service Already Opened"},0,{"$f":"IF(O283>VLOOKUP(L283,'Drop Down'!$A$3:$B$10,2,0),\"1\",\"0\")","v":"0"},0,{"$f":"SUM(Table1[[#This Row],[Case Aide Hours]],Table1[[#This Row],[Case Aide Travel Time]])","v":0},{"$f":"IFERROR(IF(OR(Table1[[#This Row],[Child Support Level]]=\"Support Services Lvl 1\", Table1[[#This Row],[Child Support Level]]=\"Support Services Lvl 2\",Table1[[#This Row],[Child Support Level]]=\"Select\"),\"Case Aid Not Allowed\", PRODUCT(Table1[[#This Row],[Total Case Aide]],VLOOKUP(Table1[[#This Row],[County Where Youth Resides]],'Drop Down'!K:M,3,0))),\"0\")","v":"Case Aid Not Allowed"},"No",0,0]
["Select","-","-","-","-","DD/MM/YYYY","DD/MM/YYYY","Select","Select",{"$f":"VLOOKUP(Table1[[#This Row],[DCYF Case Region]],'Drop Down'!$F$3:$G$9,2,0)","v":"Select"},"Select","Select","Select",{"$f":"IFERROR(IF(M284=\"No\",INDEX(IndexMatch!C:C,MATCH(1,(IndexMatch!A:A=VLOOKUP(H284,'Drop Down'!K:L,2,0))*(IndexMatch!B:B=L284),0)),\"Service Already Opened\"),\"N/A\")","v":"Service Already Opened"},0,{"$f":"IF(O284>VLOOKUP(L284,'Drop Down'!$A$3:$B$10,2,0),\"1\",\"0\")","v":"0"},0,{"$f":"SUM(Table1[[#This Row],[Case Aide Hours]],Table1[[#This Row],[Case Aide Travel Time]])","v":0},{"$f":"IFERROR(IF(OR(Table1[[#This Row],[Child Support Level]]=\"Support Services Lvl 1\", Table1[[#This Row],[Child Support Level]]=\"Support Services Lvl 2\",Table1[[#This Row],[Child Support Level]]=\"Select\"),\"Case Aid Not Allowed\", PRODUCT(Table1[[#This Row],[Total Case Aide]],VLOOKUP(Table1[[#This Row],[County Where Youth Resides]],'Drop Down'!K:M,3,0))),\"0\")","v":"Case Aid Not Allowed"},"No",0,0]
["Select","-","-","-","-","DD/MM/YYYY","DD/MM/YYYY","Select","Select",{"$f":"VLOOKUP(Table1[[#This Row],[DCYF Case Region]],'Drop Down'!$F$3:$G$9,2,0)","v":"Select"},"Select","Select","Select",{"$f":"IFERROR(IF(M285=\"No\",INDEX(IndexMatch!C:C,MATCH(1,(IndexMatch!A:A=VLOOKUP(H285,'Drop Down'!K:L,2,0))*(IndexMatch!B:B=L285),0)),\"Service Already Opened\"),\"N/A\")","v":"Service Already Opened"},0,{"$f":"IF(O285>VLOOKUP(L285,'Drop Down'!$A$3:$B$10,2,0),\"1\",\"0\")","v":"0"},0,{"$f":"SUM(Table1[[#This Row],[Case Aide Hours]],Table1[[#This Row],[Case Aide Travel Time]])","v":0},{"$f":"IFERROR(IF(OR(Table1[[#This Row],[Child Support Level]]=\"Support Services Lvl 1\", Table1[[#This Row],[Child Support Level]]=\"Support Services Lvl 2\",Table1[[#This Row],[Child Support Level]]=\"Select\"),\"Case Aid Not Allowed\", PRODUCT(Table1[[#This Row],[Total Case Aide]],VLOOKUP(Table1[[#This Row],[County Where Youth Resides]],'Drop Down'!K:M,3,0))),\"0\")","v":"Case Aid Not Allowed"},"No",0,0]
["Select","-","-","-","-","DD/MM/YYYY","DD/MM/YYYY","Select","Select",{"$f":"VLOOKUP(Table1[[#This Row],[DCYF Case Region]],'Drop Down'!$F$3:$G$9,2,0)","v":"Select"},"Select","Select","Select",{"$f":"IFERROR(IF(M286=\"No\",INDEX(IndexMatch!C:C,MATCH(1,(IndexMatch!A:A=VLOOKUP(H286,'Drop Down'!K:L,2,0))*(IndexMatch!B:B=L286),0)),\"Service Already Opened\"),\"N/A\")","v":"Service Already Opened"},0,{"$f":"IF(O286>VLOOKUP(L286,'Drop Down'!$A$3:$B$10,2,0),\"1\",\"0\")","v":"0"},0,{"$f":"SUM(Table1[[#This Row],[Case Aide Hours]],Table1[[#This Row],[Case Aide Travel Time]])","v":0},{"$f":"IFERROR(IF(OR(Table1[[#This Row],[Child Support Level]]=\"Support Services Lvl 1\", Table1[[#This Row],[Child Support Level]]=\"Support Services Lvl 2\",Table1[[#This Row],[Child Support Level]]=\"Select\"),\"Case Aid Not Allowed\", PRODUCT(Table1[[#This Row],[Total Case Aide]],VLOOKUP(Table1[[#This Row],[County Where Youth Resides]],'Drop Down'!K:M,3,0))),\"0\")","v":"Case Aid Not Allowed"},"No",0,0]
["Select","-","-","-","-","DD/MM/YYYY","DD/MM/YYYY","Select","Select",{"$f":"VLOOKUP(Table1[[#This Row],[DCYF Case Region]],'Drop Down'!$F$3:$G$9,2,0)","v":"Select"},"Select","Select","Select",{"$f":"IFERROR(IF(M287=\"No\",INDEX(IndexMatch!C:C,MATCH(1,(IndexMatch!A:A=VLOOKUP(H287,'Drop Down'!K:L,2,0))*(IndexMatch!B:B=L287),0)),\"Service Already Opened\"),\"N/A\")","v":"Service Already Opened"},0,{"$f":"IF(O287>VLOOKUP(L287,'Drop Down'!$A$3:$B$10,2,0),\"1\",\"0\")","v":"0"},0,{"$f":"SUM(Table1[[#This Row],[Case Aide Hours]],Table1[[#This Row],[Case Aide Travel Time]])","v":0},{"$f":"IFERROR(IF(OR(Table1[[#This Row],[Child Support Level]]=\"Support Services Lvl 1\", Table1[[#This Row],[Child Support Level]]=\"Support Services Lvl 2\",Table1[[#This Row],[Child Support Level]]=\"Select\"),\"Case Aid Not Allowed\", PRODUCT(Table1[[#This Row],[Total Case Aide]],VLOOKUP(Table1[[#This Row],[County Where Youth Resides]],'Drop Down'!K:M,3,0))),\"0\")","v":"Case Aid Not Allowed"},"No",0,0]
["Select","-","-","-","-","DD/MM/YYYY","DD/MM/YYYY","Select","Select",{"$f":"VLOOKUP(Table1[[#This Row],[DCYF Case Region]],'Drop Down'!$F$3:$G$9,2,0)","v":"Select"},"Select","Select","Select",{"$f":"IFERROR(IF(M288=\"No\",INDEX(IndexMatch!C:C,MATCH(1,(IndexMatch!A:A=VLOOKUP(H288,'Drop Down'!K:L,2,0))*(IndexMatch!B:B=L288),0)),\"Service Already Opened\"),\"N/A\")","v":"Service Already Opened"},0,{"$f":"IF(O288>VLOOKUP(L288,'Drop Down'!$A$3:$B$10,2,0),\"1\",\"0\")","v":"0"},0,{"$f":"SUM(Table1[[#This Row],[Case Aide Hours]],Table1[[#This Row],[Case Aide Travel Time]])","v":0},{"$f":"IFERROR(IF(OR(Table1[[#This Row],[Child Support Level]]=\"Support Services Lvl 1\", Table1[[#This Row],[Child Support Level]]=\"Support Services Lvl 2\",Table1[[#This Row],[Child Support Level]]=\"Select\"),\"Case Aid Not Allowed\", PRODUCT(Table1[[#This Row],[Total Case Aide]],VLOOKUP(Table1[[#This Row],[County Where Youth Resides]],'Drop Down'!K:M,3,0))),\"0\")","v":"Case Aid Not Allowed"},"No",0,0]
["Select","-","-","-","-","DD/MM/YYYY","DD/MM/YYYY","Select","Select",{"$f":"VLOOKUP(Table1[[#This Row],[DCYF Case Region]],'Drop Down'!$F$3:$G$9,2,0)","v":"Select"},"Select","Select","Select",{"$f":"IFERROR(IF(M289=\"No\",INDEX(IndexMatch!C:C,MATCH(1,(IndexMatch!A:A=VLOOKUP(H289,'Drop Down'!K:L,2,0))*(IndexMatch!B:B=L289),0)),\"Service Already Opened\"),\"N/A\")","v":"Service Already Opened"},0,{"$f":"IF(O289>VLOOKUP(L289,'Drop Down'!$A$3:$B$10,2,0),\"1\",\"0\")","v":"0"},0,{"$f":"SUM(Table1[[#This Row],[Case Aide Hours]],Table1[[#This Row],[Case Aide Travel Time]])","v":0},{"$f":"IFERROR(IF(OR(Table1[[#This Row],[Child Support Level]]=\"Support Services Lvl 1\", Table1[[#This Row],[Child Support Level]]=\"Support Services Lvl 2\",Table1[[#This Row],[Child Support Level]]=\"Select\"),\"Case Aid Not Allowed\", PRODUCT(Table1[[#This Row],[Total Case Aide]],VLOOKUP(Table1[[#This Row],[County Where Youth Resides]],'Drop Down'!K:M,3,0))),\"0\")","v":"Case Aid Not Allowed"},"No",0,0]
["Select","-","-","-","-","DD/MM/YYYY","DD/MM/YYYY","Select","Select",{"$f":"VLOOKUP(Table1[[#This Row],[DCYF Case Region]],'Drop Down'!$F$3:$G$9,2,0)","v":"Select"},"Select","Select","Select",{"$f":"IFERROR(IF(M290=\"No\",INDEX(IndexMatch!C:C,MATCH(1,(IndexMatch!A:A=VLOOKUP(H290,'Drop Down'!K:L,2,0))*(IndexMatch!B:B=L290),0)),\"Service Already Opened\"),\"N/A\")","v":"Service Already Opened"},0,{"$f":"IF(O290>VLOOKUP(L290,'Drop Down'!$A$3:$B$10,2,0),\"1\",\"0\")","v":"0"},0,{"$f":"SUM(Table1[[#This Row],[Case Aide Hours]],Table1[[#This Row],[Case Aide Travel Time]])","v":0},{"$f":"IFERROR(IF(OR(Table1[[#This Row],[Child Support Level]]=\"Support Services Lvl 1\", Table1[[#This Row],[Child Support Level]]=\"Support Services Lvl 2\",Table1[[#This Row],[Child Support Level]]=\"Select\"),\"Case Aid Not Allowed\", PRODUCT(Table1[[#This Row],[Total Case Aide]],VLOOKUP(Table1[[#This Row],[County Where Youth Resides]],'Drop Down'!K:M,3,0))),\"0\")","v":"Case Aid Not Allowed"},"No",0,0]
["Select","-","-","-","-","DD/MM/YYYY","DD/MM/YYYY","Select","Select",{"$f":"VLOOKUP(Table1[[#This Row],[DCYF Case Region]],'Drop Down'!$F$3:$G$9,2,0)","v":"Select"},"Select","Select","Select",{"$f":"IFERROR(IF(M291=\"No\",INDEX(IndexMatch!C:C,MATCH(1,(IndexMatch!A:A=VLOOKUP(H291,'Drop Down'!K:L,2,0))*(IndexMatch!B:B=L291),0)),\"Service Already Opened\"),\"N/A\")","v":"Service Already Opened"},0,{"$f":"IF(O291>VLOOKUP(L291,'Drop Down'!$A$3:$B$10,2,0),\"1\",\"0\")","v":"0"},0,{"$f":"SUM(Table1[[#This Row],[Case Aide Hours]],Table1[[#This Row],[Case Aide Travel Time]])","v":0},{"$f":"IFERROR(IF(OR(Table1[[#This Row],[Child Support Level]]=\"Support Services Lvl 1\", Table1[[#This Row],[Child Support Level]]=\"Support Services Lvl 2\",Table1[[#This Row],[Child Support Level]]=\"Select\"),\"Case Aid Not Allowed\", PRODUCT(Table1[[#This Row],[Total Case Aide]],VLOOKUP(Table1[[#This Row],[County Where Youth Resides]],'Drop Down'!K:M,3,0))),\"0\")","v":"Case Aid Not Allowed"},"No",0,0]
["Select","-","-","-","-","DD/MM/YYYY","DD/MM/YYYY","Select","Select",{"$f":"VLOOKUP(Table1[[#This Row],[DCYF Case Region]],'Drop Down'!$F$3:$G$9,2,0)","v":"Select"},"Select","Select","Select",{"$f":"IFERROR(IF(M292=\"No\",INDEX(IndexMatch!C:C,MATCH(1,(IndexMatch!A:A=VLOOKUP(H292,'Drop Down'!K:L,2,0))*(IndexMatch!B:B=L292),0)),\"Service Already Opened\"),\"N/A\")","v":"Service Already Opened"},0,{"$f":"IF(O292>VLOOKUP(L292,'Drop Down'!$A$3:$B$10,2,0),\"1\",\"0\")","v":"0"},0,{"$f":"SUM(Table1[[#This Row],[Case Aide Hours]],Table1[[#This Row],[Case Aide Travel Time]])","v":0},{"$f":"IFERROR(IF(OR(Table1[[#This Row],[Child Support Level]]=\"Support Services Lvl 1\", Table1[[#This Row],[Child Support Level]]=\"Support Services Lvl 2\",Table1[[#This Row],[Child Support Level]]=\"Select\"),\"Case Aid Not Allowed\", PRODUCT(Table1[[#This Row],[Total Case Aide]],VLOOKUP(Table1[[#This Row],[County Where Youth Resides]],'Drop Down'!K:M,3,0))),\"0\")","v":"Case Aid Not Allowed"},"No",0,0]
["Select","-","-","-","-","DD/MM/YYYY","DD/MM/YYYY","Select","Select",{"$f":"VLOOKUP(Table1[[#This Row],[DCYF Case Region]],'Drop Down'!$F$3:$G$9,2,0)","v":"Select"},"Select","Select","Select",{"$f":"IFERROR(IF(M293=\"No\",INDEX(IndexMatch!C:C,MATCH(1,(IndexMatch!A:A=VLOOKUP(H293,'Drop Down'!K:L,2,0))*(IndexMatch!B:B=L293),0)),\"Service Already Opened\"),\"N/A\")","v":"Service Already Opened"},0,{"$f":"IF(O293>VLOOKUP(L293,'Drop Down'!$A$3:$B$10,2,0),\"1\",\"0\")","v":"0"},0,{"$f":"SUM(Table1[[#This Row],[Case Aide Hours]],Table1[[#This Row],[Case Aide Travel Time]])","v":0},{"$f":"IFERROR(IF(OR(Table1[[#This Row],[Child Support Level]]=\"Support Services Lvl 1\", Table1[[#This Row],[Child Support Level]]=\"Support Services Lvl 2\",Table1[[#This Row],[Child Support Level]]=\"Select\"),\"Case Aid Not Allowed\", PRODUCT(Table1[[#This Row],[Total Case Aide]],VLOOKUP(Table1[[#This Row],[County Where Youth Resides]],'Drop Down'!K:M,3,0))),\"0\")","v":"Case Aid Not Allowed"},"No",0,0]
["Select","-","-","-","-","DD/MM/YYYY","DD/MM/YYYY","Select","Select",{"$f":"VLOOKUP(Table1[[#This Row],[DCYF Case Region]],'Drop Down'!$F$3:$G$9,2,0)","v":"Select"},"Select","Select","Select",{"$f":"IFERROR(IF(M294=\"No\",INDEX(IndexMatch!C:C,MATCH(1,(IndexMatch!A:A=VLOOKUP(H294,'Drop Down'!K:L,2,0))*(IndexMatch!B:B=L294),0)),\"Service Already Opened\"),\"N/A\")","v":"Service Already Opened"},0,{"$f":"IF(O294>VLOOKUP(L294,'Drop Down'!$A$3:$B$10,2,0),\"1\",\"0\")","v":"0"},0,{"$f":"SUM(Table1[[#This Row],[Case Aide Hours]],Table1[[#This Row],[Case Aide Travel Time]])","v":0},{"$f":"IFERROR(IF(OR(Table1[[#This Row],[Child Support Level]]=\"Support Services Lvl 1\", Table1[[#This Row],[Child Support Level]]=\"Support Services Lvl 2\",Table1[[#This Row],[Child Support Level]]=\"Select\"),\"Case Aid Not Allowed\", PRODUCT(Table1[[#This Row],[Total Case Aide]],VLOOKUP(Table1[[#This Row],[County Where Youth Resides]],'Drop Down'!K:M,3,0))),\"0\")","v":"Case Aid Not Allowed"},"No",0,0]
["Select","-","-","-","-","DD/MM/YYYY","DD/MM/YYYY","Select","Select",{"$f":"VLOOKUP(Table1[[#This Row],[DCYF Case Region]],'Drop Down'!$F$3:$G$9,2,0)","v":"Select"},"Select","Select","Select",{"$f":"IFERROR(IF(M295=\"No\",INDEX(IndexMatch!C:C,MATCH(1,(IndexMatch!A:A=VLOOKUP(H295,'Drop Down'!K:L,2,0))*(IndexMatch!B:B=L295),0)),\"Service Already Opened\"),\"N/A\")","v":"Service Already Opened"},0,{"$f":"IF(O295>VLOOKUP(L295,'Drop Down'!$A$3:$B$10,2,0),\"1\",\"0\")","v":"0"},0,{"$f":"SUM(Table1[[#This Row],[Case Aide Hours]],Table1[[#This Row],[Case Aide Travel Time]])","v":0},{"$f":"IFERROR(IF(OR(Table1[[#This Row],[Child Support Level]]=\"Support Services Lvl 1\", Table1[[#This Row],[Child Support Level]]=\"Support Services Lvl 2\",Table1[[#This Row],[Child Support Level]]=\"Select\"),\"Case Aid Not Allowed\", PRODUCT(Table1[[#This Row],[Total Case Aide]],VLOOKUP(Table1[[#This Row],[County Where Youth Resides]],'Drop Down'!K:M,3,0))),\"0\")","v":"Case Aid Not Allowed"},"No",0,0]
["Select","-","-","-","-","DD/MM/YYYY","DD/MM/YYYY","Select","Select",{"$f":"VLOOKUP(Table1[[#This Row],[DCYF Case Region]],'Drop Down'!$F$3:$G$9,2,0)","v":"Select"},"Select","Select","Select",{"$f":"IFERROR(IF(M296=\"No\",INDEX(IndexMatch!C:C,MATCH(1,(IndexMatch!A:A=VLOOKUP(H296,'Drop Down'!K:L,2,0))*(IndexMatch!B:B=L296),0)),\"Service Already Opened\"),\"N/A\")","v":"Service Already Opened"},0,{"$f":"IF(O296>VLOOKUP(L296,'Drop Down'!$A$3:$B$10,2,0),\"1\",\"0\")","v":"0"},0,{"$f":"SUM(Table1[[#This Row],[Case Aide Hours]],Table1[[#This Row],[Case Aide Travel Time]])","v":0},{"$f":"IFERROR(IF(OR(Table1[[#This Row],[Child Support Level]]=\"Support Services Lvl 1\", Table1[[#This Row],[Child Support Level]]=\"Support Services Lvl 2\",Table1[[#This Row],[Child Support Level]]=\"Select\"),\"Case Aid Not Allowed\", PRODUCT(Table1[[#This Row],[Total Case Aide]],VLOOKUP(Table1[[#This Row],[County Where Youth Resides]],'Drop Down'!K:M,3,0))),\"0\")","v":"Case Aid Not Allowed"},"No",0,0]
["Select","-","-","-","-","DD/MM/YYYY","DD/MM/YYYY","Select","Select",{"$f":"VLOOKUP(Table1[[#This Row],[DCYF Case Region]],'Drop Down'!$F$3:$G$9,2,0)","v":"Select"},"Select","Select","Select",{"$f":"IFERROR(IF(M297=\"No\",INDEX(IndexMatch!C:C,MATCH(1,(IndexMatch!A:A=VLOOKUP(H297,'Drop Down'!K:L,2,0))*(IndexMatch!B:B=L297),0)),\"Service Already Opened\"),\"N/A\")","v":"Service Already Opened"},0,{"$f":"IF(O297>VLOOKUP(L297,'Drop Down'!$A$3:$B$10,2,0),\"1\",\"0\")","v":"0"},0,{"$f":"SUM(Table1[[#This Row],[Case Aide Hours]],Table1[[#This Row],[Case Aide Travel Time]])","v":0},{"$f":"IFERROR(IF(OR(Table1[[#This Row],[Child Support Level]]=\"Support Services Lvl 1\", Table1[[#This Row],[Child Support Level]]=\"Support Services Lvl 2\",Table1[[#This Row],[Child Support Level]]=\"Select\"),\"Case Aid Not Allowed\", PRODUCT(Table1[[#This Row],[Total Case Aide]],VLOOKUP(Table1[[#This Row],[County Where Youth Resides]],'Drop Down'!K:M,3,0))),\"0\")","v":"Case Aid Not Allowed"},"No",0,0]
["Select","-","-","-","-","DD/MM/YYYY","DD/MM/YYYY","Select","Select",{"$f":"VLOOKUP(Table1[[#This Row],[DCYF Case Region]],'Drop Down'!$F$3:$G$9,2,0)","v":"Select"},"Select","Select","Select",{"$f":"IFERROR(IF(M298=\"No\",INDEX(IndexMatch!C:C,MATCH(1,(IndexMatch!A:A=VLOOKUP(H298,'Drop Down'!K:L,2,0))*(IndexMatch!B:B=L298),0)),\"Service Already Opened\"),\"N/A\")","v":"Service Already Opened"},0,{"$f":"IF(O298>VLOOKUP(L298,'Drop Down'!$A$3:$B$10,2,0),\"1\",\"0\")","v":"0"},0,{"$f":"SUM(Table1[[#This Row],[Case Aide Hours]],Table1[[#This Row],[Case Aide Travel Time]])","v":0},{"$f":"IFERROR(IF(OR(Table1[[#This Row],[Child Support Level]]=\"Support Services Lvl 1\", Table1[[#This Row],[Child Support Level]]=\"Support Services Lvl 2\",Table1[[#This Row],[Child Support Level]]=\"Select\"),\"Case Aid Not Allowed\", PRODUCT(Table1[[#This Row],[Total Case Aide]],VLOOKUP(Table1[[#This Row],[County Where Youth Resides]],'Drop Down'!K:M,3,0))),\"0\")","v":"Case Aid Not Allowed"},"No",0,0]
["Select","-","-","-","-","DD/MM/YYYY","DD/MM/YYYY","Select","Select",{"$f":"VLOOKUP(Table1[[#This Row],[DCYF Case Region]],'Drop Down'!$F$3:$G$9,2,0)","v":"Select"},"Select","Select","Select",{"$f":"IFERROR(IF(M299=\"No\",INDEX(IndexMatch!C:C,MATCH(1,(IndexMatch!A:A=VLOOKUP(H299,'Drop Down'!K:L,2,0))*(IndexMatch!B:B=L299),0)),\"Service Already Opened\"),\"N/A\")","v":"Service Already Opened"},0,{"$f":"IF(O299>VLOOKUP(L299,'Drop Down'!$A$3:$B$10,2,0),\"1\",\"0\")","v":"0"},0,{"$f":"SUM(Table1[[#This Row],[Case Aide Hours]],Table1[[#This Row],[Case Aide Travel Time]])","v":0},{"$f":"IFERROR(IF(OR(Table1[[#This Row],[Child Support Level]]=\"Support Services Lvl 1\", Table1[[#This Row],[Child Support Level]]=\"Support Services Lvl 2\",Table1[[#This Row],[Child Support Level]]=\"Select\"),\"Case Aid Not Allowed\", PRODUCT(Table1[[#This Row],[Total Case Aide]],VLOOKUP(Table1[[#This Row],[County Where Youth Resides]],'Drop Down'!K:M,3,0))),\"0\")","v":"Case Aid Not Allowed"},"No",0,0]
["Select","-","-","-","-","DD/MM/YYYY","DD/MM/YYYY","Select","Select",{"$f":"VLOOKUP(Table1[[#This Row],[DCYF Case Region]],'Drop Down'!$F$3:$G$9,2,0)","v":"Select"},"Select","Select","Select",{"$f":"IFERROR(IF(M300=\"No\",INDEX(IndexMatch!C:C,MATCH(1,(IndexMatch!A:A=VLOOKUP(H300,'Drop Down'!K:L,2,0))*(IndexMatch!B:B=L300),0)),\"Service Already Opened\"),\"N/A\")","v":"Service Already Opened"},0,{"$f":"IF(O300>VLOOKUP(L300,'Drop Down'!$A$3:$B$10,2,0),\"1\",\"0\")","v":"0"},0,{"$f":"SUM(Table1[[#This Row],[Case Aide Hours]],Table1[[#This Row],[Case Aide Travel Time]])","v":0},{"$f":"IFERROR(IF(OR(Table1[[#This Row],[Child Support Level]]=\"Support Services Lvl 1\", Table1[[#This Row],[Child Support Level]]=\"Support Services Lvl 2\",Table1[[#This Row],[Child Support Level]]=\"Select\"),\"Case Aid Not Allowed\", PRODUCT(Table1[[#This Row],[Total Case Aide]],VLOOKUP(Table1[[#This Row],[County Where Youth Resides]],'Drop Down'!K:M,3,0))),\"0\")","v":"Case Aid Not Allowed"},"No",0,0]
["Select","-","-","-","-","DD/MM/YYYY","DD/MM/YYYY","Select","Select",{"$f":"VLOOKUP(Table1[[#This Row],[DCYF Case Region]],'Drop Down'!$F$3:$G$9,2,0)","v":"Select"},"Select","Select","Select",{"$f":"IFERROR(IF(M301=\"No\",INDEX(IndexMatch!C:C,MATCH(1,(IndexMatch!A:A=VLOOKUP(H301,'Drop Down'!K:L,2,0))*(IndexMatch!B:B=L301),0)),\"Service Already Opened\"),\"N/A\")","v":"Service Already Opened"},0,{"$f":"IF(O301>VLOOKUP(L301,'Drop Down'!$A$3:$B$10,2,0),\"1\",\"0\")","v":"0"},0,{"$f":"SUM(Table1[[#This Row],[Case Aide Hours]],Table1[[#This Row],[Case Aide Travel Time]])","v":0},{"$f":"IFERROR(IF(OR(Table1[[#This Row],[Child Support Level]]=\"Support Services Lvl 1\", Table1[[#This Row],[Child Support Level]]=\"Support Services Lvl 2\",Table1[[#This Row],[Child Support Level]]=\"Select\"),\"Case Aid Not Allowed\", PRODUCT(Table1[[#This Row],[Total Case Aide]],VLOOKUP(Table1[[#This Row],[County Where Youth Resides]],'Drop Down'!K:M,3,0))),\"0\")","v":"Case Aid Not Allowed"},"No",0,0]
["Select","-","-","-","-","DD/MM/YYYY","DD/MM/YYYY","Select","Select",{"$f":"VLOOKUP(Table1[[#This Row],[DCYF Case Region]],'Drop Down'!$F$3:$G$9,2,0)","v":"Select"},"Select","Select","Select",{"$f":"IFERROR(IF(M302=\"No\",INDEX(IndexMatch!C:C,MATCH(1,(IndexMatch!A:A=VLOOKUP(H302,'Drop Down'!K:L,2,0))*(IndexMatch!B:B=L302),0)),\"Service Already Opened\"),\"N/A\")","v":"Service Already Opened"},0,{"$f":"IF(O302>VLOOKUP(L302,'Drop Down'!$A$3:$B$10,2,0),\"1\",\"0\")","v":"0"},0,{"$f":"SUM(Table1[[#This Row],[Case Aide Hours]],Table1[[#This Row],[Case Aide Travel Time]])","v":0},{"$f":"IFERROR(IF(OR(Table1[[#This Row],[Child Support Level]]=\"Support Services Lvl 1\", Table1[[#This Row],[Child Support Level]]=\"Support Services Lvl 2\",Table1[[#This Row],[Child Support Level]]=\"Select\"),\"Case Aid Not Allowed\", PRODUCT(Table1[[#This Row],[Total Case Aide]],VLOOKUP(Table1[[#This Row],[County Where Youth Resides]],'Drop Down'!K:M,3,0))),\"0\")","v":"Case Aid Not Allowed"},"No",0,0]
["Select","-","-","-","-","DD/MM/YYYY","DD/MM/YYYY","Select","Select",{"$f":"VLOOKUP(Table1[[#This Row],[DCYF Case Region]],'Drop Down'!$F$3:$G$9,2,0)","v":"Select"},"Select","Select","Select",{"$f":"IFERROR(IF(M303=\"No\",INDEX(IndexMatch!C:C,MATCH(1,(IndexMatch!A:A=VLOOKUP(H303,'Drop Down'!K:L,2,0))*(IndexMatch!B:B=L303),0)),\"Service Already Opened\"),\"N/A\")","v":"Service Already Opened"},0,{"$f":"IF(O303>VLOOKUP(L303,'Drop Down'!$A$3:$B$10,2,0),\"1\",\"0\")","v":"0"},0,{"$f":"SUM(Table1[[#This Row],[Case Aide Hours]],Table1[[#This Row],[Case Aide Travel Time]])","v":0},{"$f":"IFERROR(IF(OR(Table1[[#This Row],[Child Support Level]]=\"Support Services Lvl 1\", Table1[[#This Row],[Child Support Level]]=\"Support Services Lvl 2\",Table1[[#This Row],[Child Support Level]]=\"Select\"),\"Case Aid Not Allowed\", PRODUCT(Table1[[#This Row],[Total Case Aide]],VLOOKUP(Table1[[#This Row],[County Where Youth Resides]],'Drop Down'!K:M,3,0))),\"0\")","v":"Case Aid Not Allowed"},"No",0,0]
["Select","-","-","-","-","DD/MM/YYYY","DD/MM/YYYY","Select","Select",{"$f":"VLOOKUP(Table1[[#This Row],[DCYF Case Region]],'Drop Down'!$F$3:$G$9,2,0)","v":"Select"},"Select","Select","Select",{"$f":"IFERROR(IF(M304=\"No\",INDEX(IndexMatch!C:C,MATCH(1,(IndexMatch!A:A=VLOOKUP(H304,'Drop Down'!K:L,2,0))*(IndexMatch!B:B=L304),0)),\"Service Already Opened\"),\"N/A\")","v":"Service Already Opened"},0,{"$f":"IF(O304>VLOOKUP(L304,'Drop Down'!$A$3:$B$10,2,0),\"1\",\"0\")","v":"0"},0,{"$f":"SUM(Table1[[#This Row],[Case Aide Hours]],Table1[[#This Row],[Case Aide Travel Time]])","v":0},{"$f":"IFERROR(IF(OR(Table1[[#This Row],[Child Support Level]]=\"Support Services Lvl 1\", Table1[[#This Row],[Child Support Level]]=\"Support Services Lvl 2\",Table1[[#This Row],[Child Support Level]]=\"Select\"),\"Case Aid Not Allowed\", PRODUCT(Table1[[#This Row],[Total Case Aide]],VLOOKUP(Table1[[#This Row],[County Where Youth Resides]],'Drop Down'!K:M,3,0))),\"0\")","v":"Case Aid Not Allowed"},"No",0,0]
["Select","-","-","-","-","DD/MM/YYYY","DD/MM/YYYY","Select","Select",{"$f":"VLOOKUP(Table1[[#This Row],[DCYF Case Region]],'Drop Down'!$F$3:$G$9,2,0)","v":"Select"},"Select","Select","Select",{"$f":"IFERROR(IF(M305=\"No\",INDEX(IndexMatch!C:C,MATCH(1,(IndexMatch!A:A=VLOOKUP(H305,'Drop Down'!K:L,2,0))*(IndexMatch!B:B=L305),0)),\"Service Already Opened\"),\"N/A\")","v":"Service Already Opened"},0,{"$f":"IF(O305>VLOOKUP(L305,'Drop Down'!$A$3:$B$10,2,0),\"1\",\"0\")","v":"0"},0,{"$f":"SUM(Table1[[#This Row],[Case Aide Hours]],Table1[[#This Row],[Case Aide Travel Time]])","v":0},{"$f":"IFERROR(IF(OR(Table1[[#This Row],[Child Support Level]]=\"Support Services Lvl 1\", Table1[[#This Row],[Child Support Level]]=\"Support Services Lvl 2\",Table1[[#This Row],[Child Support Level]]=\"Select\"),\"Case Aid Not Allowed\", PRODUCT(Table1[[#This Row],[Total Case Aide]],VLOOKUP(Table1[[#This Row],[County Where Youth Resides]],'Drop Down'!K:M,3,0))),\"0\")","v":"Case Aid Not Allowed"},"No",0,0]
["Select","-","-","-","-","DD/MM/YYYY","DD/MM/YYYY","Select","Select",{"$f":"VLOOKUP(Table1[[#This Row],[DCYF Case Region]],'Drop Down'!$F$3:$G$9,2,0)","v":"Select"},"Select","Select","Select",{"$f":"IFERROR(IF(M306=\"No\",INDEX(IndexMatch!C:C,MATCH(1,(IndexMatch!A:A=VLOOKUP(H306,'Drop Down'!K:L,2,0))*(IndexMatch!B:B=L306),0)),\"Service Already Opened\"),\"N/A\")","v":"Service Already Opened"},0,{"$f":"IF(O306>VLOOKUP(L306,'Drop Down'!$A$3:$B$10,2,0),\"1\",\"0\")","v":"0"},0,{"$f":"SUM(Table1[[#This Row],[Case Aide Hours]],Table1[[#This Row],[Case Aide Travel Time]])","v":0},{"$f":"IFERROR(IF(OR(Table1[[#This Row],[Child Support Level]]=\"Support Services Lvl 1\", Table1[[#This Row],[Child Support Level]]=\"Support Services Lvl 2\",Table1[[#This Row],[Child Support Level]]=\"Select\"),\"Case Aid Not Allowed\", PRODUCT(Table1[[#This Row],[Total Case Aide]],VLOOKUP(Table1[[#This Row],[County Where Youth Resides]],'Drop Down'!K:M,3,0))),\"0\")","v":"Case Aid Not Allowed"},"No",0,0]
["Select","-","-","-","-","DD/MM/YYYY","DD/MM/YYYY","Select","Select",{"$f":"VLOOKUP(Table1[[#This Row],[DCYF Case Region]],'Drop Down'!$F$3:$G$9,2,0)","v":"Select"},"Select","Select","Select",{"$f":"IFERROR(IF(M307=\"No\",INDEX(IndexMatch!C:C,MATCH(1,(IndexMatch!A:A=VLOOKUP(H307,'Drop Down'!K:L,2,0))*(IndexMatch!B:B=L307),0)),\"Service Already Opened\"),\"N/A\")","v":"Service Already Opened"},0,{"$f":"IF(O307>VLOOKUP(L307,'Drop Down'!$A$3:$B$10,2,0),\"1\",\"0\")","v":"0"},0,{"$f":"SUM(Table1[[#This Row],[Case Aide Hours]],Table1[[#This Row],[Case Aide Travel Time]])","v":0},{"$f":"IFERROR(IF(OR(Table1[[#This Row],[Child Support Level]]=\"Support Services Lvl 1\", Table1[[#This Row],[Child Support Level]]=\"Support Services Lvl 2\",Table1[[#This Row],[Child Support Level]]=\"Select\"),\"Case Aid Not Allowed\", PRODUCT(Table1[[#This Row],[Total Case Aide]],VLOOKUP(Table1[[#This Row],[County Where Youth Resides]],'Drop Down'!K:M,3,0))),\"0\")","v":"Case Aid Not Allowed"},"No",0,0]
["Select","-","-","-","-","DD/MM/YYYY","DD/MM/YYYY","Select","Select",{"$f":"VLOOKUP(Table1[[#This Row],[DCYF Case Region]],'Drop Down'!$F$3:$G$9,2,0)","v":"Select"},"Select","Select","Select",{"$f":"IFERROR(IF(M308=\"No\",INDEX(IndexMatch!C:C,MATCH(1,(IndexMatch!A:A=VLOOKUP(H308,'Drop Down'!K:L,2,0))*(IndexMatch!B:B=L308),0)),\"Service Already Opened\"),\"N/A\")","v":"Service Already Opened"},0,{"$f":"IF(O308>VLOOKUP(L308,'Drop Down'!$A$3:$B$10,2,0),\"1\",\"0\")","v":"0"},0,{"$f":"SUM(Table1[[#This Row],[Case Aide Hours]],Table1[[#This Row],[Case Aide Travel Time]])","v":0},{"$f":"IFERROR(IF(OR(Table1[[#This Row],[Child Support Level]]=\"Support Services Lvl 1\", Table1[[#This Row],[Child Support Level]]=\"Support Services Lvl 2\",Table1[[#This Row],[Child Support Level]]=\"Select\"),\"Case Aid Not Allowed\", PRODUCT(Table1[[#This Row],[Total Case Aide]],VLOOKUP(Table1[[#This Row],[County Where Youth Resides]],'Drop Down'!K:M,3,0))),\"0\")","v":"Case Aid Not Allowed"},"No",0,0]
["Select","-","-","-","-","DD/MM/YYYY","DD/MM/YYYY","Select","Select",{"$f":"VLOOKUP(Table1[[#This Row],[DCYF Case Region]],'Drop Down'!$F$3:$G$9,2,0)","v":"Select"},"Select","Select","Select",{"$f":"IFERROR(IF(M309=\"No\",INDEX(IndexMatch!C:C,MATCH(1,(IndexMatch!A:A=VLOOKUP(H309,'Drop Down'!K:L,2,0))*(IndexMatch!B:B=L309),0)),\"Service Already Opened\"),\"N/A\")","v":"Service Already Opened"},0,{"$f":"IF(O309>VLOOKUP(L309,'Drop Down'!$A$3:$B$10,2,0),\"1\",\"0\")","v":"0"},0,{"$f":"SUM(Table1[[#This Row],[Case Aide Hours]],Table1[[#This Row],[Case Aide Travel Time]])","v":0},{"$f":"IFERROR(IF(OR(Table1[[#This Row],[Child Support Level]]=\"Support Services Lvl 1\", Table1[[#This Row],[Child Support Level]]=\"Support Services Lvl 2\",Table1[[#This Row],[Child Support Level]]=\"Select\"),\"Case Aid Not Allowed\", PRODUCT(Table1[[#This Row],[Total Case Aide]],VLOOKUP(Table1[[#This Row],[County Where Youth Resides]],'Drop Down'!K:M,3,0))),\"0\")","v":"Case Aid Not Allowed"},"No",0,0]
["Select","-","-","-","-","DD/MM/YYYY","DD/MM/YYYY","Select","Select",{"$f":"VLOOKUP(Table1[[#This Row],[DCYF Case Region]],'Drop Down'!$F$3:$G$9,2,0)","v":"Select"},"Select","Select","Select",{"$f":"IFERROR(IF(M310=\"No\",INDEX(IndexMatch!C:C,MATCH(1,(IndexMatch!A:A=VLOOKUP(H310,'Drop Down'!K:L,2,0))*(IndexMatch!B:B=L310),0)),\"Service Already Opened\"),\"N/A\")","v":"Service Already Opened"},0,{"$f":"IF(O310>VLOOKUP(L310,'Drop Down'!$A$3:$B$10,2,0),\"1\",\"0\")","v":"0"},0,{"$f":"SUM(Table1[[#This Row],[Case Aide Hours]],Table1[[#This Row],[Case Aide Travel Time]])","v":0},{"$f":"IFERROR(IF(OR(Table1[[#This Row],[Child Support Level]]=\"Support Services Lvl 1\", Table1[[#This Row],[Child Support Level]]=\"Support Services Lvl 2\",Table1[[#This Row],[Child Support Level]]=\"Select\"),\"Case Aid Not Allowed\", PRODUCT(Table1[[#This Row],[Total Case Aide]],VLOOKUP(Table1[[#This Row],[County Where Youth Resides]],'Drop Down'!K:M,3,0))),\"0\")","v":"Case Aid Not Allowed"},"No",0,0]
["Select","-","-","-","-","DD/MM/YYYY","DD/MM/YYYY","Select","Select",{"$f":"VLOOKUP(Table1[[#This Row],[DCYF Case Region]],'Drop Down'!$F$3:$G$9,2,0)","v":"Select"},"Select","Select","Select",{"$f":"IFERROR(IF(M311=\"No\",INDEX(IndexMatch!C:C,MATCH(1,(IndexMatch!A:A=VLOOKUP(H311,'Drop Down'!K:L,2,0))*(IndexMatch!B:B=L311),0)),\"Service Already Opened\"),\"N/A\")","v":"Service Already Opened"},0,{"$f":"IF(O311>VLOOKUP(L311,'Drop Down'!$A$3:$B$10,2,0),\"1\",\"0\")","v":"0"},0,{"$f":"SUM(Table1[[#This Row],[Case Aide Hours]],Table1[[#This Row],[Case Aide Travel Time]])","v":0},{"$f":"IFERROR(IF(OR(Table1[[#This Row],[Child Support Level]]=\"Support Services Lvl 1\", Table1[[#This Row],[Child Support Level]]=\"Support Services Lvl 2\",Table1[[#This Row],[Child Support Level]]=\"Select\"),\"Case Aid Not Allowed\", PRODUCT(Table1[[#This Row],[Total Case Aide]],VLOOKUP(Table1[[#This Row],[County Where Youth Resides]],'Drop Down'!K:M,3,0))),\"0\")","v":"Case Aid Not Allowed"},"No",0,0]
["Select","-","-","-","-","DD/MM/YYYY","DD/MM/YYYY","Select","Select",{"$f":"VLOOKUP(Table1[[#This Row],[DCYF Case Region]],'Drop Down'!$F$3:$G$9,2,0)","v":"Select"},"Select","Select","Select",{"$f":"IFERROR(IF(M312=\"No\",INDEX(IndexMatch!C:C,MATCH(1,(IndexMatch!A:A=VLOOKUP(H312,'Drop Down'!K:L,2,0))*(IndexMatch!B:B=L312),0)),\"Service Already Opened\"),\"N/A\")","v":"Service Already Opened"},0,{"$f":"IF(O312>VLOOKUP(L312,'Drop Down'!$A$3:$B$10,2,0),\"1\",\"0\")","v":"0"},0,{"$f":"SUM(Table1[[#This Row],[Case Aide Hours]],Table1[[#This Row],[Case Aide Travel Time]])","v":0},{"$f":"IFERROR(IF(OR(Table1[[#This Row],[Child Support Level]]=\"Support Services Lvl 1\", Table1[[#This Row],[Child Support Level]]=\"Support Services Lvl 2\",Table1[[#This Row],[Child Support Level]]=\"Select\"),\"Case Aid Not Allowed\", PRODUCT(Table1[[#This Row],[Total Case Aide]],VLOOKUP(Table1[[#This Row],[County Where Youth Resides]],'Drop Down'!K:M,3,0))),\"0\")","v":"Case Aid Not Allowed"},"No",0,0]
["Select","-","-","-","-","DD/MM/YYYY","DD/MM/YYYY","Select","Select",{"$f":"VLOOKUP(Table1[[#This Row],[DCYF Case Region]],'Drop Down'!$F$3:$G$9,2,0)","v":"Select"},"Select","Select","Select",{"$f":"IFERROR(IF(M313=\"No\",INDEX(IndexMatch!C:C,MATCH(1,(IndexMatch!A:A=VLOOKUP(H313,'Drop Down'!K:L,2,0))*(IndexMatch!B:B=L313),0)),\"Service Already Opened\"),\"N/A\")","v":"Service Already Opened"},0,{"$f":"IF(O313>VLOOKUP(L313,'Drop Down'!$A$3:$B$10,2,0),\"1\",\"0\")","v":"0"},0,{"$f":"SUM(Table1[[#This Row],[Case Aide Hours]],Table1[[#This Row],[Case Aide Travel Time]])","v":0},{"$f":"IFERROR(IF(OR(Table1[[#This Row],[Child Support Level]]=\"Support Services Lvl 1\", Table1[[#This Row],[Child Support Level]]=\"Support Services Lvl 2\",Table1[[#This Row],[Child Support Level]]=\"Select\"),\"Case Aid Not Allowed\", PRODUCT(Table1[[#This Row],[Total Case Aide]],VLOOKUP(Table1[[#This Row],[County Where Youth Resides]],'Drop Down'!K:M,3,0))),\"0\")","v":"Case Aid Not Allowed"},"No",0,0]
["Select","-","-","-","-","DD/MM/YYYY","DD/MM/YYYY","Select","Select",{"$f":"VLOOKUP(Table1[[#This Row],[DCYF Case Region]],'Drop Down'!$F$3:$G$9,2,0)","v":"Select"},"Select","Select","Select",{"$f":"IFERROR(IF(M314=\"No\",INDEX(IndexMatch!C:C,MATCH(1,(IndexMatch!A:A=VLOOKUP(H314,'Drop Down'!K:L,2,0))*(IndexMatch!B:B=L314),0)),\"Service Already Opened\"),\"N/A\")","v":"Service Already Opened"},0,{"$f":"IF(O314>VLOOKUP(L314,'Drop Down'!$A$3:$B$10,2,0),\"1\",\"0\")","v":"0"},0,{"$f":"SUM(Table1[[#This Row],[Case Aide Hours]],Table1[[#This Row],[Case Aide Travel Time]])","v":0},{"$f":"IFERROR(IF(OR(Table1[[#This Row],[Child Support Level]]=\"Support Services Lvl 1\", Table1[[#This Row],[Child Support Level]]=\"Support Services Lvl 2\",Table1[[#This Row],[Child Support Level]]=\"Select\"),\"Case Aid Not Allowed\", PRODUCT(Table1[[#This Row],[Total Case Aide]],VLOOKUP(Table1[[#This Row],[County Where Youth Resides]],'Drop Down'!K:M,3,0))),\"0\")","v":"Case Aid Not Allowed"},"No",0,0]
["Select","-","-","-","-","DD/MM/YYYY","DD/MM/YYYY","Select","Select",{"$f":"VLOOKUP(Table1[[#This Row],[DCYF Case Region]],'Drop Down'!$F$3:$G$9,2,0)","v":"Select"},"Select","Select","Select",{"$f":"IFERROR(IF(M315=\"No\",INDEX(IndexMatch!C:C,MATCH(1,(IndexMatch!A:A=VLOOKUP(H315,'Drop Down'!K:L,2,0))*(IndexMatch!B:B=L315),0)),\"Service Already Opened\"),\"N/A\")","v":"Service Already Opened"},0,{"$f":"IF(O315>VLOOKUP(L315,'Drop Down'!$A$3:$B$10,2,0),\"1\",\"0\")","v":"0"},0,{"$f":"SUM(Table1[[#This Row],[Case Aide Hours]],Table1[[#This Row],[Case Aide Travel Time]])","v":0},{"$f":"IFERROR(IF(OR(Table1[[#This Row],[Child Support Level]]=\"Support Services Lvl 1\", Table1[[#This Row],[Child Support Level]]=\"Support Services Lvl 2\",Table1[[#This Row],[Child Support Level]]=\"Select\"),\"Case Aid Not Allowed\", PRODUCT(Table1[[#This Row],[Total Case Aide]],VLOOKUP(Table1[[#This Row],[County Where Youth Resides]],'Drop Down'!K:M,3,0))),\"0\")","v":"Case Aid Not Allowed"},"No",0,0]
["Select","-","-","-","-","DD/MM/YYYY","DD/MM/YYYY","Select","Select",{"$f":"VLOOKUP(Table1[[#This Row],[DCYF Case Region]],'Drop Down'!$F$3:$G$9,2,0)","v":"Select"},"Select","Select","Select",{"$f":"IFERROR(IF(M316=\"No\",INDEX(IndexMatch!C:C,MATCH(1,(IndexMatch!A:A=VLOOKUP(H316,'Drop Down'!K:L,2,0))*(IndexMatch!B:B=L316),0)),\"Service Already Opened\"),\"N/A\")","v":"Service Already Opened"},0,{"$f":"IF(O316>VLOOKUP(L316,'Drop Down'!$A$3:$B$10,2,0),\"1\",\"0\")","v":"0"},0,{"$f":"SUM(Table1[[#This Row],[Case Aide Hours]],Table1[[#This Row],[Case Aide Travel Time]])","v":0},{"$f":"IFERROR(IF(OR(Table1[[#This Row],[Child Support Level]]=\"Support Services Lvl 1\", Table1[[#This Row],[Child Support Level]]=\"Support Services Lvl 2\",Table1[[#This Row],[Child Support Level]]=\"Select\"),\"Case Aid Not Allowed\", PRODUCT(Table1[[#This Row],[Total Case Aide]],VLOOKUP(Table1[[#This Row],[County Where Youth Resides]],'Drop Down'!K:M,3,0))),\"0\")","v":"Case Aid Not Allowed"},"No",0,0]
["Select","-","-","-","-","DD/MM/YYYY","DD/MM/YYYY","Select","Select",{"$f":"VLOOKUP(Table1[[#This Row],[DCYF Case Region]],'Drop Down'!$F$3:$G$9,2,0)","v":"Select"},"Select","Select","Select",{"$f":"IFERROR(IF(M317=\"No\",INDEX(IndexMatch!C:C,MATCH(1,(IndexMatch!A:A=VLOOKUP(H317,'Drop Down'!K:L,2,0))*(IndexMatch!B:B=L317),0)),\"Service Already Opened\"),\"N/A\")","v":"Service Already Opened"},0,{"$f":"IF(O317>VLOOKUP(L317,'Drop Down'!$A$3:$B$10,2,0),\"1\",\"0\")","v":"0"},0,{"$f":"SUM(Table1[[#This Row],[Case Aide Hours]],Table1[[#This Row],[Case Aide Travel Time]])","v":0},{"$f":"IFERROR(IF(OR(Table1[[#This Row],[Child Support Level]]=\"Support Services Lvl 1\", Table1[[#This Row],[Child Support Level]]=\"Support Services Lvl 2\",Table1[[#This Row],[Child Support Level]]=\"Select\"),\"Case Aid Not Allowed\", PRODUCT(Table1[[#This Row],[Total Case Aide]],VLOOKUP(Table1[[#This Row],[County Where Youth Resides]],'Drop Down'!K:M,3,0))),\"0\")","v":"Case Aid Not Allowed"},"No",0,0]
["Select","-","-","-","-","DD/MM/YYYY","DD/MM/YYYY","Select","Select",{"$f":"VLOOKUP(Table1[[#This Row],[DCYF Case Region]],'Drop Down'!$F$3:$G$9,2,0)","v":"Select"},"Select","Select","Select",{"$f":"IFERROR(IF(M318=\"No\",INDEX(IndexMatch!C:C,MATCH(1,(IndexMatch!A:A=VLOOKUP(H318,'Drop Down'!K:L,2,0))*(IndexMatch!B:B=L318),0)),\"Service Already Opened\"),\"N/A\")","v":"Service Already Opened"},0,{"$f":"IF(O318>VLOOKUP(L318,'Drop Down'!$A$3:$B$10,2,0),\"1\",\"0\")","v":"0"},0,{"$f":"SUM(Table1[[#This Row],[Case Aide Hours]],Table1[[#This Row],[Case Aide Travel Time]])","v":0},{"$f":"IFERROR(IF(OR(Table1[[#This Row],[Child Support Level]]=\"Support Services Lvl 1\", Table1[[#This Row],[Child Support Level]]=\"Support Services Lvl 2\",Table1[[#This Row],[Child Support Level]]=\"Select\"),\"Case Aid Not Allowed\", PRODUCT(Table1[[#This Row],[Total Case Aide]],VLOOKUP(Table1[[#This Row],[County Where Youth Resides]],'Drop Down'!K:M,3,0))),\"0\")","v":"Case Aid Not Allowed"},"No",0,0]
["Select","-","-","-","-","DD/MM/YYYY","DD/MM/YYYY","Select","Select",{"$f":"VLOOKUP(Table1[[#This Row],[DCYF Case Region]],'Drop Down'!$F$3:$G$9,2,0)","v":"Select"},"Select","Select","Select",{"$f":"IFERROR(IF(M319=\"No\",INDEX(IndexMatch!C:C,MATCH(1,(IndexMatch!A:A=VLOOKUP(H319,'Drop Down'!K:L,2,0))*(IndexMatch!B:B=L319),0)),\"Service Already Opened\"),\"N/A\")","v":"Service Already Opened"},0,{"$f":"IF(O319>VLOOKUP(L319,'Drop Down'!$A$3:$B$10,2,0),\"1\",\"0\")","v":"0"},0,{"$f":"SUM(Table1[[#This Row],[Case Aide Hours]],Table1[[#This Row],[Case Aide Travel Time]])","v":0},{"$f":"IFERROR(IF(OR(Table1[[#This Row],[Child Support Level]]=\"Support Services Lvl 1\", Table1[[#This Row],[Child Support Level]]=\"Support Services Lvl 2\",Table1[[#This Row],[Child Support Level]]=\"Select\"),\"Case Aid Not Allowed\", PRODUCT(Table1[[#This Row],[Total Case Aide]],VLOOKUP(Table1[[#This Row],[County Where Youth Resides]],'Drop Down'!K:M,3,0))),\"0\")","v":"Case Aid Not Allowed"},"No",0,0]
["Select","-","-","-","-","DD/MM/YYYY","DD/MM/YYYY","Select","Select",{"$f":"VLOOKUP(Table1[[#This Row],[DCYF Case Region]],'Drop Down'!$F$3:$G$9,2,0)","v":"Select"},"Select","Select","Select",{"$f":"IFERROR(IF(M320=\"No\",INDEX(IndexMatch!C:C,MATCH(1,(IndexMatch!A:A=VLOOKUP(H320,'Drop Down'!K:L,2,0))*(IndexMatch!B:B=L320),0)),\"Service Already Opened\"),\"N/A\")","v":"Service Already Opened"},0,{"$f":"IF(O320>VLOOKUP(L320,'Drop Down'!$A$3:$B$10,2,0),\"1\",\"0\")","v":"0"},0,{"$f":"SUM(Table1[[#This Row],[Case Aide Hours]],Table1[[#This Row],[Case Aide Travel Time]])","v":0},{"$f":"IFERROR(IF(OR(Table1[[#This Row],[Child Support Level]]=\"Support Services Lvl 1\", Table1[[#This Row],[Child Support Level]]=\"Support Services Lvl 2\",Table1[[#This Row],[Child Support Level]]=\"Select\"),\"Case Aid Not Allowed\", PRODUCT(Table1[[#This Row],[Total Case Aide]],VLOOKUP(Table1[[#This Row],[County Where Youth Resides]],'Drop Down'!K:M,3,0))),\"0\")","v":"Case Aid Not Allowed"},"No",0,0]
["Select","-","-","-","-","DD/MM/YYYY","DD/MM/YYYY","Select","Select",{"$f":"VLOOKUP(Table1[[#This Row],[DCYF Case Region]],'Drop Down'!$F$3:$G$9,2,0)","v":"Select"},"Select","Select","Select",{"$f":"IFERROR(IF(M321=\"No\",INDEX(IndexMatch!C:C,MATCH(1,(IndexMatch!A:A=VLOOKUP(H321,'Drop Down'!K:L,2,0))*(IndexMatch!B:B=L321),0)),\"Service Already Opened\"),\"N/A\")","v":"Service Already Opened"},0,{"$f":"IF(O321>VLOOKUP(L321,'Drop Down'!$A$3:$B$10,2,0),\"1\",\"0\")","v":"0"},0,{"$f":"SUM(Table1[[#This Row],[Case Aide Hours]],Table1[[#This Row],[Case Aide Travel Time]])","v":0},{"$f":"IFERROR(IF(OR(Table1[[#This Row],[Child Support Level]]=\"Support Services Lvl 1\", Table1[[#This Row],[Child Support Level]]=\"Support Services Lvl 2\",Table1[[#This Row],[Child Support Level]]=\"Select\"),\"Case Aid Not Allowed\", PRODUCT(Table1[[#This Row],[Total Case Aide]],VLOOKUP(Table1[[#This Row],[County Where Youth Resides]],'Drop Down'!K:M,3,0))),\"0\")","v":"Case Aid Not Allowed"},"No",0,0]
["Select","-","-","-","-","DD/MM/YYYY","DD/MM/YYYY","Select","Select",{"$f":"VLOOKUP(Table1[[#This Row],[DCYF Case Region]],'Drop Down'!$F$3:$G$9,2,0)","v":"Select"},"Select","Select","Select",{"$f":"IFERROR(IF(M322=\"No\",INDEX(IndexMatch!C:C,MATCH(1,(IndexMatch!A:A=VLOOKUP(H322,'Drop Down'!K:L,2,0))*(IndexMatch!B:B=L322),0)),\"Service Already Opened\"),\"N/A\")","v":"Service Already Opened"},0,{"$f":"IF(O322>VLOOKUP(L322,'Drop Down'!$A$3:$B$10,2,0),\"1\",\"0\")","v":"0"},0,{"$f":"SUM(Table1[[#This Row],[Case Aide Hours]],Table1[[#This Row],[Case Aide Travel Time]])","v":0},{"$f":"IFERROR(IF(OR(Table1[[#This Row],[Child Support Level]]=\"Support Services Lvl 1\", Table1[[#This Row],[Child Support Level]]=\"Support Services Lvl 2\",Table1[[#This Row],[Child Support Level]]=\"Select\"),\"Case Aid Not Allowed\", PRODUCT(Table1[[#This Row],[Total Case Aide]],VLOOKUP(Table1[[#This Row],[County Where Youth Resides]],'Drop Down'!K:M,3,0))),\"0\")","v":"Case Aid Not Allowed"},"No",0,{"$f":"ROUND(PRODUCT(U322,0.67),2)","v":0}]
["Select","-","-","-","-","DD/MM/YYYY","DD/MM/YYYY","Select","Select",{"$f":"VLOOKUP(Table1[[#This Row],[DCYF Case Region]],'Drop Down'!$F$3:$G$9,2,0)","v":"Select"},"Select","Select","Select",{"$f":"IFERROR(IF(M323=\"No\",INDEX(IndexMatch!C:C,MATCH(1,(IndexMatch!A:A=VLOOKUP(H323,'Drop Down'!K:L,2,0))*(IndexMatch!B:B=L323),0)),\"Service Already Opened\"),\"N/A\")","v":"Service Already Opened"},0,{"$f":"IF(O323>VLOOKUP(L323,'Drop Down'!$A$3:$B$10,2,0),\"1\",\"0\")","v":"0"},0,{"$f":"SUM(Table1[[#This Row],[Case Aide Hours]],Table1[[#This Row],[Case Aide Travel Time]])","v":0},{"$f":"IFERROR(IF(OR(Table1[[#This Row],[Child Support Level]]=\"Support Services Lvl 1\", Table1[[#This Row],[Child Support Level]]=\"Support Services Lvl 2\",Table1[[#This Row],[Child Support Level]]=\"Select\"),\"Case Aid Not Allowed\", PRODUCT(Table1[[#This Row],[Total Case Aide]],VLOOKUP(Table1[[#This Row],[County Where Youth Resides]],'Drop Down'!K:M,3,0))),\"0\")","v":"Case Aid Not Allowed"},{"$f":"IF(P323=\"1\",\"Yes\",\"No\")","v":"No"},0,0]
["Select","-","-","-","-","DD/MM/YYYY","DD/MM/YYYY","Select","Select",{"$f":"VLOOKUP(Table1[[#This Row],[DCYF Case Region]],'Drop Down'!$F$3:$G$9,2,0)","v":"Select"},"Select","Select","Select",{"$f":"IFERROR(IF(M324=\"No\",INDEX(IndexMatch!C:C,MATCH(1,(IndexMatch!A:A=VLOOKUP(H324,'Drop Down'!K:L,2,0))*(IndexMatch!B:B=L324),0)),\"Service Already Opened\"),\"N/A\")","v":"Service Already Opened"},0,{"$f":"IF(O324>VLOOKUP(L324,'Drop Down'!$A$3:$B$10,2,0),\"1\",\"0\")","v":"0"},0,{"$f":"SUM(Table1[[#This Row],[Case Aide Hours]],Table1[[#This Row],[Case Aide Travel Time]])","v":0},{"$f":"IFERROR(IF(OR(Table1[[#This Row],[Child Support Level]]=\"Support Services Lvl 1\", Table1[[#This Row],[Child Support Level]]=\"Support Services Lvl 2\",Table1[[#This Row],[Child Support Level]]=\"Select\"),\"Case Aid Not Allowed\", PRODUCT(Table1[[#This Row],[Total Case Aide]],VLOOKUP(Table1[[#This Row],[County Where Youth Resides]],'Drop Down'!K:M,3,0))),\"0\")","v":"Case Aid Not Allowed"},"No",0,0]
["Select","-","-","-","-","DD/MM/YYYY","DD/MM/YYYY","Select","Select",{"$f":"VLOOKUP(Table1[[#This Row],[DCYF Case Region]],'Drop Down'!$F$3:$G$9,2,0)","v":"Select"},"Select","Select","Select",{"$f":"IFERROR(IF(M325=\"No\",INDEX(IndexMatch!C:C,MATCH(1,(IndexMatch!A:A=VLOOKUP(H325,'Drop Down'!K:L,2,0))*(IndexMatch!B:B=L325),0)),\"Service Already Opened\"),\"N/A\")","v":"Service Already Opened"},0,{"$f":"IF(O325>VLOOKUP(L325,'Drop Down'!$A$3:$B$10,2,0),\"1\",\"0\")","v":"0"},0,{"$f":"SUM(Table1[[#This Row],[Case Aide Hours]],Table1[[#This Row],[Case Aide Travel Time]])","v":0},{"$f":"IFERROR(IF(OR(Table1[[#This Row],[Child Support Level]]=\"Support Services Lvl 1\", Table1[[#This Row],[Child Support Level]]=\"Support Services Lvl 2\",Table1[[#This Row],[Child Support Level]]=\"Select\"),\"Case Aid Not Allowed\", PRODUCT(Table1[[#This Row],[Total Case Aide]],VLOOKUP(Table1[[#This Row],[County Where Youth Resides]],'Drop Down'!K:M,3,0))),\"0\")","v":"Case Aid Not Allowed"},"No",0,0]
["Select","-","-","-","-","DD/MM/YYYY","DD/MM/YYYY","Select","Select",{"$f":"VLOOKUP(Table1[[#This Row],[DCYF Case Region]],'Drop Down'!$F$3:$G$9,2,0)","v":"Select"},"Select","Select","Select",{"$f":"IFERROR(IF(M326=\"No\",INDEX(IndexMatch!C:C,MATCH(1,(IndexMatch!A:A=VLOOKUP(H326,'Drop Down'!K:L,2,0))*(IndexMatch!B:B=L326),0)),\"Service Already Opened\"),\"N/A\")","v":"Service Already Opened"},0,{"$f":"IF(O326>VLOOKUP(L326,'Drop Down'!$A$3:$B$10,2,0),\"1\",\"0\")","v":"0"},0,{"$f":"SUM(Table1[[#This Row],[Case Aide Hours]],Table1[[#This Row],[Case Aide Travel Time]])","v":0},{"$f":"IFERROR(IF(OR(Table1[[#This Row],[Child Support Level]]=\"Support Services Lvl 1\", Table1[[#This Row],[Child Support Level]]=\"Support Services Lvl 2\",Table1[[#This Row],[Child Support Level]]=\"Select\"),\"Case Aid Not Allowed\", PRODUCT(Table1[[#This Row],[Total Case Aide]],VLOOKUP(Table1[[#This Row],[County Where Youth Resides]],'Drop Down'!K:M,3,0))),\"0\")","v":"Case Aid Not Allowed"},"No",0,0]
["Select","-","-","-","-","DD/MM/YYYY","DD/MM/YYYY","Select","Select",{"$f":"VLOOKUP(Table1[[#This Row],[DCYF Case Region]],'Drop Down'!$F$3:$G$9,2,0)","v":"Select"},"Select","Select","Select",{"$f":"IFERROR(IF(M327=\"No\",INDEX(IndexMatch!C:C,MATCH(1,(IndexMatch!A:A=VLOOKUP(H327,'Drop Down'!K:L,2,0))*(IndexMatch!B:B=L327),0)),\"Service Already Opened\"),\"N/A\")","v":"Service Already Opened"},0,{"$f":"IF(O327>VLOOKUP(L327,'Drop Down'!$A$3:$B$10,2,0),\"1\",\"0\")","v":"0"},0,{"$f":"SUM(Table1[[#This Row],[Case Aide Hours]],Table1[[#This Row],[Case Aide Travel Time]])","v":0},{"$f":"IFERROR(IF(OR(Table1[[#This Row],[Child Support Level]]=\"Support Services Lvl 1\", Table1[[#This Row],[Child Support Level]]=\"Support Services Lvl 2\",Table1[[#This Row],[Child Support Level]]=\"Select\"),\"Case Aid Not Allowed\", PRODUCT(Table1[[#This Row],[Total Case Aide]],VLOOKUP(Table1[[#This Row],[County Where Youth Resides]],'Drop Down'!K:M,3,0))),\"0\")","v":"Case Aid Not Allowed"},"No",0,0]
["Select","-","-","-","-","DD/MM/YYYY","DD/MM/YYYY","Select","Select",{"$f":"VLOOKUP(Table1[[#This Row],[DCYF Case Region]],'Drop Down'!$F$3:$G$9,2,0)","v":"Select"},"Select","Select","Select",{"$f":"IFERROR(IF(M328=\"No\",INDEX(IndexMatch!C:C,MATCH(1,(IndexMatch!A:A=VLOOKUP(H328,'Drop Down'!K:L,2,0))*(IndexMatch!B:B=L328),0)),\"Service Already Opened\"),\"N/A\")","v":"Service Already Opened"},0,{"$f":"IF(O328>VLOOKUP(L328,'Drop Down'!$A$3:$B$10,2,0),\"1\",\"0\")","v":"0"},0,{"$f":"SUM(Table1[[#This Row],[Case Aide Hours]],Table1[[#This Row],[Case Aide Travel Time]])","v":0},{"$f":"IFERROR(IF(OR(Table1[[#This Row],[Child Support Level]]=\"Support Services Lvl 1\", Table1[[#This Row],[Child Support Level]]=\"Support Services Lvl 2\",Table1[[#This Row],[Child Support Level]]=\"Select\"),\"Case Aid Not Allowed\", PRODUCT(Table1[[#This Row],[Total Case Aide]],VLOOKUP(Table1[[#This Row],[County Where Youth Resides]],'Drop Down'!K:M,3,0))),\"0\")","v":"Case Aid Not Allowed"},"No",0,0]
["Select","-","-","-","-","DD/MM/YYYY","DD/MM/YYYY","Select","Select",{"$f":"VLOOKUP(Table1[[#This Row],[DCYF Case Region]],'Drop Down'!$F$3:$G$9,2,0)","v":"Select"},"Select","Select","Select",{"$f":"IFERROR(IF(M329=\"No\",INDEX(IndexMatch!C:C,MATCH(1,(IndexMatch!A:A=VLOOKUP(H329,'Drop Down'!K:L,2,0))*(IndexMatch!B:B=L329),0)),\"Service Already Opened\"),\"N/A\")","v":"Service Already Opened"},0,{"$f":"IF(O329>VLOOKUP(L329,'Drop Down'!$A$3:$B$10,2,0),\"1\",\"0\")","v":"0"},0,{"$f":"SUM(Table1[[#This Row],[Case Aide Hours]],Table1[[#This Row],[Case Aide Travel Time]])","v":0},{"$f":"IFERROR(IF(OR(Table1[[#This Row],[Child Support Level]]=\"Support Services Lvl 1\", Table1[[#This Row],[Child Support Level]]=\"Support Services Lvl 2\",Table1[[#This Row],[Child Support Level]]=\"Select\"),\"Case Aid Not Allowed\", PRODUCT(Table1[[#This Row],[Total Case Aide]],VLOOKUP(Table1[[#This Row],[County Where Youth Resides]],'Drop Down'!K:M,3,0))),\"0\")","v":"Case Aid Not Allowed"},"No",0,0]
["Select","-","-","-","-","DD/MM/YYYY","DD/MM/YYYY","Select","Select",{"$f":"VLOOKUP(Table1[[#This Row],[DCYF Case Region]],'Drop Down'!$F$3:$G$9,2,0)","v":"Select"},"Select","Select","Select",{"$f":"IFERROR(IF(M330=\"No\",INDEX(IndexMatch!C:C,MATCH(1,(IndexMatch!A:A=VLOOKUP(H330,'Drop Down'!K:L,2,0))*(IndexMatch!B:B=L330),0)),\"Service Already Opened\"),\"N/A\")","v":"Service Already Opened"},0,{"$f":"IF(O330>VLOOKUP(L330,'Drop Down'!$A$3:$B$10,2,0),\"1\",\"0\")","v":"0"},0,{"$f":"SUM(Table1[[#This Row],[Case Aide Hours]],Table1[[#This Row],[Case Aide Travel Time]])","v":0},{"$f":"IFERROR(IF(OR(Table1[[#This Row],[Child Support Level]]=\"Support Services Lvl 1\", Table1[[#This Row],[Child Support Level]]=\"Support Services Lvl 2\",Table1[[#This Row],[Child Support Level]]=\"Select\"),\"Case Aid Not Allowed\", PRODUCT(Table1[[#This Row],[Total Case Aide]],VLOOKUP(Table1[[#This Row],[County Where Youth Resides]],'Drop Down'!K:M,3,0))),\"0\")","v":"Case Aid Not Allowed"},"No",0,0]
["Select","-","-","-","-","DD/MM/YYYY","DD/MM/YYYY","Select","Select",{"$f":"VLOOKUP(Table1[[#This Row],[DCYF Case Region]],'Drop Down'!$F$3:$G$9,2,0)","v":"Select"},"Select","Select","Select",{"$f":"IFERROR(IF(M331=\"No\",INDEX(IndexMatch!C:C,MATCH(1,(IndexMatch!A:A=VLOOKUP(H331,'Drop Down'!K:L,2,0))*(IndexMatch!B:B=L331),0)),\"Service Already Opened\"),\"N/A\")","v":"Service Already Opened"},0,{"$f":"IF(O331>VLOOKUP(L331,'Drop Down'!$A$3:$B$10,2,0),\"1\",\"0\")","v":"0"},0,{"$f":"SUM(Table1[[#This Row],[Case Aide Hours]],Table1[[#This Row],[Case Aide Travel Time]])","v":0},{"$f":"IFERROR(IF(OR(Table1[[#This Row],[Child Support Level]]=\"Support Services Lvl 1\", Table1[[#This Row],[Child Support Level]]=\"Support Services Lvl 2\",Table1[[#This Row],[Child Support Level]]=\"Select\"),\"Case Aid Not Allowed\", PRODUCT(Table1[[#This Row],[Total Case Aide]],VLOOKUP(Table1[[#This Row],[County Where Youth Resides]],'Drop Down'!K:M,3,0))),\"0\")","v":"Case Aid Not Allowed"},"No",0,0]
["Select","-","-","-","-","DD/MM/YYYY","DD/MM/YYYY","Select","Select",{"$f":"VLOOKUP(Table1[[#This Row],[DCYF Case Region]],'Drop Down'!$F$3:$G$9,2,0)","v":"Select"},"Select","Select","Select",{"$f":"IFERROR(IF(M332=\"No\",INDEX(IndexMatch!C:C,MATCH(1,(IndexMatch!A:A=VLOOKUP(H332,'Drop Down'!K:L,2,0))*(IndexMatch!B:B=L332),0)),\"Service Already Opened\"),\"N/A\")","v":"Service Already Opened"},0,{"$f":"IF(O332>VLOOKUP(L332,'Drop Down'!$A$3:$B$10,2,0),\"1\",\"0\")","v":"0"},0,{"$f":"SUM(Table1[[#This Row],[Case Aide Hours]],Table1[[#This Row],[Case Aide Travel Time]])","v":0},{"$f":"IFERROR(IF(OR(Table1[[#This Row],[Child Support Level]]=\"Support Services Lvl 1\", Table1[[#This Row],[Child Support Level]]=\"Support Services Lvl 2\",Table1[[#This Row],[Child Support Level]]=\"Select\"),\"Case Aid Not Allowed\", PRODUCT(Table1[[#This Row],[Total Case Aide]],VLOOKUP(Table1[[#This Row],[County Where Youth Resides]],'Drop Down'!K:M,3,0))),\"0\")","v":"Case Aid Not Allowed"},"No",0,0]
["Select","-","-","-","-","DD/MM/YYYY","DD/MM/YYYY","Select","Select",{"$f":"VLOOKUP(Table1[[#This Row],[DCYF Case Region]],'Drop Down'!$F$3:$G$9,2,0)","v":"Select"},"Select","Select","Select",{"$f":"IFERROR(IF(M333=\"No\",INDEX(IndexMatch!C:C,MATCH(1,(IndexMatch!A:A=VLOOKUP(H333,'Drop Down'!K:L,2,0))*(IndexMatch!B:B=L333),0)),\"Service Already Opened\"),\"N/A\")","v":"Service Already Opened"},0,{"$f":"IF(O333>VLOOKUP(L333,'Drop Down'!$A$3:$B$10,2,0),\"1\",\"0\")","v":"0"},0,{"$f":"SUM(Table1[[#This Row],[Case Aide Hours]],Table1[[#This Row],[Case Aide Travel Time]])","v":0},{"$f":"IFERROR(IF(OR(Table1[[#This Row],[Child Support Level]]=\"Support Services Lvl 1\", Table1[[#This Row],[Child Support Level]]=\"Support Services Lvl 2\",Table1[[#This Row],[Child Support Level]]=\"Select\"),\"Case Aid Not Allowed\", PRODUCT(Table1[[#This Row],[Total Case Aide]],VLOOKUP(Table1[[#This Row],[County Where Youth Resides]],'Drop Down'!K:M,3,0))),\"0\")","v":"Case Aid Not Allowed"},"No",0,0]
["Select","-","-","-","-","DD/MM/YYYY","DD/MM/YYYY","Select","Select",{"$f":"VLOOKUP(Table1[[#This Row],[DCYF Case Region]],'Drop Down'!$F$3:$G$9,2,0)","v":"Select"},"Select","Select","Select",{"$f":"IFERROR(IF(M334=\"No\",INDEX(IndexMatch!C:C,MATCH(1,(IndexMatch!A:A=VLOOKUP(H334,'Drop Down'!K:L,2,0))*(IndexMatch!B:B=L334),0)),\"Service Already Opened\"),\"N/A\")","v":"Service Already Opened"},0,{"$f":"IF(O334>VLOOKUP(L334,'Drop Down'!$A$3:$B$10,2,0),\"1\",\"0\")","v":"0"},0,{"$f":"SUM(Table1[[#This Row],[Case Aide Hours]],Table1[[#This Row],[Case Aide Travel Time]])","v":0},{"$f":"IFERROR(IF(OR(Table1[[#This Row],[Child Support Level]]=\"Support Services Lvl 1\", Table1[[#This Row],[Child Support Level]]=\"Support Services Lvl 2\",Table1[[#This Row],[Child Support Level]]=\"Select\"),\"Case Aid Not Allowed\", PRODUCT(Table1[[#This Row],[Total Case Aide]],VLOOKUP(Table1[[#This Row],[County Where Youth Resides]],'Drop Down'!K:M,3,0))),\"0\")","v":"Case Aid Not Allowed"},"No",0,0]
["Select","-","-","-","-","DD/MM/YYYY","DD/MM/YYYY","Select","Select",{"$f":"VLOOKUP(Table1[[#This Row],[DCYF Case Region]],'Drop Down'!$F$3:$G$9,2,0)","v":"Select"},"Select","Select","Select",{"$f":"IFERROR(IF(M335=\"No\",INDEX(IndexMatch!C:C,MATCH(1,(IndexMatch!A:A=VLOOKUP(H335,'Drop Down'!K:L,2,0))*(IndexMatch!B:B=L335),0)),\"Service Already Opened\"),\"N/A\")","v":"Service Already Opened"},0,{"$f":"IF(O335>VLOOKUP(L335,'Drop Down'!$A$3:$B$10,2,0),\"1\",\"0\")","v":"0"},0,{"$f":"SUM(Table1[[#This Row],[Case Aide Hours]],Table1[[#This Row],[Case Aide Travel Time]])","v":0},{"$f":"IFERROR(IF(OR(Table1[[#This Row],[Child Support Level]]=\"Support Services Lvl 1\", Table1[[#This Row],[Child Support Level]]=\"Support Services Lvl 2\",Table1[[#This Row],[Child Support Level]]=\"Select\"),\"Case Aid Not Allowed\", PRODUCT(Table1[[#This Row],[Total Case Aide]],VLOOKUP(Table1[[#This Row],[County Where Youth Resides]],'Drop Down'!K:M,3,0))),\"0\")","v":"Case Aid Not Allowed"},"No",0,0]
["Select","-","-","-","-","DD/MM/YYYY","DD/MM/YYYY","Select","Select",{"$f":"VLOOKUP(Table1[[#This Row],[DCYF Case Region]],'Drop Down'!$F$3:$G$9,2,0)","v":"Select"},"Select","Select","Select",{"$f":"IFERROR(IF(M336=\"No\",INDEX(IndexMatch!C:C,MATCH(1,(IndexMatch!A:A=VLOOKUP(H336,'Drop Down'!K:L,2,0))*(IndexMatch!B:B=L336),0)),\"Service Already Opened\"),\"N/A\")","v":"Service Already Opened"},0,{"$f":"IF(O336>VLOOKUP(L336,'Drop Down'!$A$3:$B$10,2,0),\"1\",\"0\")","v":"0"},0,{"$f":"SUM(Table1[[#This Row],[Case Aide Hours]],Table1[[#This Row],[Case Aide Travel Time]])","v":0},{"$f":"IFERROR(IF(OR(Table1[[#This Row],[Child Support Level]]=\"Support Services Lvl 1\", Table1[[#This Row],[Child Support Level]]=\"Support Services Lvl 2\",Table1[[#This Row],[Child Support Level]]=\"Select\"),\"Case Aid Not Allowed\", PRODUCT(Table1[[#This Row],[Total Case Aide]],VLOOKUP(Table1[[#This Row],[County Where Youth Resides]],'Drop Down'!K:M,3,0))),\"0\")","v":"Case Aid Not Allowed"},"No",0,0]
["Select","-","-","-","-","DD/MM/YYYY","DD/MM/YYYY","Select","Select",{"$f":"VLOOKUP(Table1[[#This Row],[DCYF Case Region]],'Drop Down'!$F$3:$G$9,2,0)","v":"Select"},"Select","Select","Select",{"$f":"IFERROR(IF(M337=\"No\",INDEX(IndexMatch!C:C,MATCH(1,(IndexMatch!A:A=VLOOKUP(H337,'Drop Down'!K:L,2,0))*(IndexMatch!B:B=L337),0)),\"Service Already Opened\"),\"N/A\")","v":"Service Already Opened"},0,{"$f":"IF(O337>VLOOKUP(L337,'Drop Down'!$A$3:$B$10,2,0),\"1\",\"0\")","v":"0"},0,{"$f":"SUM(Table1[[#This Row],[Case Aide Hours]],Table1[[#This Row],[Case Aide Travel Time]])","v":0},{"$f":"IFERROR(IF(OR(Table1[[#This Row],[Child Support Level]]=\"Support Services Lvl 1\", Table1[[#This Row],[Child Support Level]]=\"Support Services Lvl 2\",Table1[[#This Row],[Child Support Level]]=\"Select\"),\"Case Aid Not Allowed\", PRODUCT(Table1[[#This Row],[Total Case Aide]],VLOOKUP(Table1[[#This Row],[County Where Youth Resides]],'Drop Down'!K:M,3,0))),\"0\")","v":"Case Aid Not Allowed"},"No",0,0]
["Select","-","-","-","-","DD/MM/YYYY","DD/MM/YYYY","Select","Select",{"$f":"VLOOKUP(Table1[[#This Row],[DCYF Case Region]],'Drop Down'!$F$3:$G$9,2,0)","v":"Select"},"Select","Select","Select",{"$f":"IFERROR(IF(M338=\"No\",INDEX(IndexMatch!C:C,MATCH(1,(IndexMatch!A:A=VLOOKUP(H338,'Drop Down'!K:L,2,0))*(IndexMatch!B:B=L338),0)),\"Service Already Opened\"),\"N/A\")","v":"Service Already Opened"},0,{"$f":"IF(O338>VLOOKUP(L338,'Drop Down'!$A$3:$B$10,2,0),\"1\",\"0\")","v":"0"},0,{"$f":"SUM(Table1[[#This Row],[Case Aide Hours]],Table1[[#This Row],[Case Aide Travel Time]])","v":0},{"$f":"IFERROR(IF(OR(Table1[[#This Row],[Child Support Level]]=\"Support Services Lvl 1\", Table1[[#This Row],[Child Support Level]]=\"Support Services Lvl 2\",Table1[[#This Row],[Child Support Level]]=\"Select\"),\"Case Aid Not Allowed\", PRODUCT(Table1[[#This Row],[Total Case Aide]],VLOOKUP(Table1[[#This Row],[County Where Youth Resides]],'Drop Down'!K:M,3,0))),\"0\")","v":"Case Aid Not Allowed"},"No",0,0]
["Select","-","-","-","-","DD/MM/YYYY","DD/MM/YYYY","Select","Select",{"$f":"VLOOKUP(Table1[[#This Row],[DCYF Case Region]],'Drop Down'!$F$3:$G$9,2,0)","v":"Select"},"Select","Select","Select",{"$f":"IFERROR(IF(M339=\"No\",INDEX(IndexMatch!C:C,MATCH(1,(IndexMatch!A:A=VLOOKUP(H339,'Drop Down'!K:L,2,0))*(IndexMatch!B:B=L339),0)),\"Service Already Opened\"),\"N/A\")","v":"Service Already Opened"},0,{"$f":"IF(O339>VLOOKUP(L339,'Drop Down'!$A$3:$B$10,2,0),\"1\",\"0\")","v":"0"},0,{"$f":"SUM(Table1[[#This Row],[Case Aide Hours]],Table1[[#This Row],[Case Aide Travel Time]])","v":0},{"$f":"IFERROR(IF(OR(Table1[[#This Row],[Child Support Level]]=\"Support Services Lvl 1\", Table1[[#This Row],[Child Support Level]]=\"Support Services Lvl 2\",Table1[[#This Row],[Child Support Level]]=\"Select\"),\"Case Aid Not Allowed\", PRODUCT(Table1[[#This Row],[Total Case Aide]],VLOOKUP(Table1[[#This Row],[County Where Youth Resides]],'Drop Down'!K:M,3,0))),\"0\")","v":"Case Aid Not Allowed"},"No",0,0]
["Select","-","-","-","-","DD/MM/YYYY","DD/MM/YYYY","Select","Select",{"$f":"VLOOKUP(Table1[[#This Row],[DCYF Case Region]],'Drop Down'!$F$3:$G$9,2,0)","v":"Select"},"Select","Select","Select",{"$f":"IFERROR(IF(M340=\"No\",INDEX(IndexMatch!C:C,MATCH(1,(IndexMatch!A:A=VLOOKUP(H340,'Drop Down'!K:L,2,0))*(IndexMatch!B:B=L340),0)),\"Service Already Opened\"),\"N/A\")","v":"Service Already Opened"},0,{"$f":"IF(O340>VLOOKUP(L340,'Drop Down'!$A$3:$B$10,2,0),\"1\",\"0\")","v":"0"},0,{"$f":"SUM(Table1[[#This Row],[Case Aide Hours]],Table1[[#This Row],[Case Aide Travel Time]])","v":0},{"$f":"IFERROR(IF(OR(Table1[[#This Row],[Child Support Level]]=\"Support Services Lvl 1\", Table1[[#This Row],[Child Support Level]]=\"Support Services Lvl 2\",Table1[[#This Row],[Child Support Level]]=\"Select\"),\"Case Aid Not Allowed\", PRODUCT(Table1[[#This Row],[Total Case Aide]],VLOOKUP(Table1[[#This Row],[County Where Youth Resides]],'Drop Down'!K:M,3,0))),\"0\")","v":"Case Aid Not Allowed"},"No",0,0]
["Select","-","-","-","-","DD/MM/YYYY","DD/MM/YYYY","Select","Select",{"$f":"VLOOKUP(Table1[[#This Row],[DCYF Case Region]],'Drop Down'!$F$3:$G$9,2,0)","v":"Select"},"Select","Select","Select",{"$f":"IFERROR(IF(M341=\"No\",INDEX(IndexMatch!C:C,MATCH(1,(IndexMatch!A:A=VLOOKUP(H341,'Drop Down'!K:L,2,0))*(IndexMatch!B:B=L341),0)),\"Service Already Opened\"),\"N/A\")","v":"Service Already Opened"},0,{"$f":"IF(O341>VLOOKUP(L341,'Drop Down'!$A$3:$B$10,2,0),\"1\",\"0\")","v":"0"},0,{"$f":"SUM(Table1[[#This Row],[Case Aide Hours]],Table1[[#This Row],[Case Aide Travel Time]])","v":0},{"$f":"IFERROR(IF(OR(Table1[[#This Row],[Child Support Level]]=\"Support Services Lvl 1\", Table1[[#This Row],[Child Support Level]]=\"Support Services Lvl 2\",Table1[[#This Row],[Child Support Level]]=\"Select\"),\"Case Aid Not Allowed\", PRODUCT(Table1[[#This Row],[Total Case Aide]],VLOOKUP(Table1[[#This Row],[County Where Youth Resides]],'Drop Down'!K:M,3,0))),\"0\")","v":"Case Aid Not Allowed"},"No",0,0]
["Select","-","-","-","-","DD/MM/YYYY","DD/MM/YYYY","Select","Select",{"$f":"VLOOKUP(Table1[[#This Row],[DCYF Case Region]],'Drop Down'!$F$3:$G$9,2,0)","v":"Select"},"Select","Select","Select",{"$f":"IFERROR(IF(M342=\"No\",INDEX(IndexMatch!C:C,MATCH(1,(IndexMatch!A:A=VLOOKUP(H342,'Drop Down'!K:L,2,0))*(IndexMatch!B:B=L342),0)),\"Service Already Opened\"),\"N/A\")","v":"Service Already Opened"},0,{"$f":"IF(O342>VLOOKUP(L342,'Drop Down'!$A$3:$B$10,2,0),\"1\",\"0\")","v":"0"},0,{"$f":"SUM(Table1[[#This Row],[Case Aide Hours]],Table1[[#This Row],[Case Aide Travel Time]])","v":0},{"$f":"IFERROR(IF(OR(Table1[[#This Row],[Child Support Level]]=\"Support Services Lvl 1\", Table1[[#This Row],[Child Support Level]]=\"Support Services Lvl 2\",Table1[[#This Row],[Child Support Level]]=\"Select\"),\"Case Aid Not Allowed\", PRODUCT(Table1[[#This Row],[Total Case Aide]],VLOOKUP(Table1[[#This Row],[County Where Youth Resides]],'Drop Down'!K:M,3,0))),\"0\")","v":"Case Aid Not Allowed"},"No",0,0]
["Select","-","-","-","-","DD/MM/YYYY","DD/MM/YYYY","Select","Select",{"$f":"VLOOKUP(Table1[[#This Row],[DCYF Case Region]],'Drop Down'!$F$3:$G$9,2,0)","v":"Select"},"Select","Select","Select",{"$f":"IFERROR(IF(M343=\"No\",INDEX(IndexMatch!C:C,MATCH(1,(IndexMatch!A:A=VLOOKUP(H343,'Drop Down'!K:L,2,0))*(IndexMatch!B:B=L343),0)),\"Service Already Opened\"),\"N/A\")","v":"Service Already Opened"},0,{"$f":"IF(O343>VLOOKUP(L343,'Drop Down'!$A$3:$B$10,2,0),\"1\",\"0\")","v":"0"},0,{"$f":"SUM(Table1[[#This Row],[Case Aide Hours]],Table1[[#This Row],[Case Aide Travel Time]])","v":0},{"$f":"IFERROR(IF(OR(Table1[[#This Row],[Child Support Level]]=\"Support Services Lvl 1\", Table1[[#This Row],[Child Support Level]]=\"Support Services Lvl 2\",Table1[[#This Row],[Child Support Level]]=\"Select\"),\"Case Aid Not Allowed\", PRODUCT(Table1[[#This Row],[Total Case Aide]],VLOOKUP(Table1[[#This Row],[County Where Youth Resides]],'Drop Down'!K:M,3,0))),\"0\")","v":"Case Aid Not Allowed"},"No",0,0]
["Select","-","-","-","-","DD/MM/YYYY","DD/MM/YYYY","Select","Select",{"$f":"VLOOKUP(Table1[[#This Row],[DCYF Case Region]],'Drop Down'!$F$3:$G$9,2,0)","v":"Select"},"Select","Select","Select",{"$f":"IFERROR(IF(M344=\"No\",INDEX(IndexMatch!C:C,MATCH(1,(IndexMatch!A:A=VLOOKUP(H344,'Drop Down'!K:L,2,0))*(IndexMatch!B:B=L344),0)),\"Service Already Opened\"),\"N/A\")","v":"Service Already Opened"},0,{"$f":"IF(O344>VLOOKUP(L344,'Drop Down'!$A$3:$B$10,2,0),\"1\",\"0\")","v":"0"},0,{"$f":"SUM(Table1[[#This Row],[Case Aide Hours]],Table1[[#This Row],[Case Aide Travel Time]])","v":0},{"$f":"IFERROR(IF(OR(Table1[[#This Row],[Child Support Level]]=\"Support Services Lvl 1\", Table1[[#This Row],[Child Support Level]]=\"Support Services Lvl 2\",Table1[[#This Row],[Child Support Level]]=\"Select\"),\"Case Aid Not Allowed\", PRODUCT(Table1[[#This Row],[Total Case Aide]],VLOOKUP(Table1[[#This Row],[County Where Youth Resides]],'Drop Down'!K:M,3,0))),\"0\")","v":"Case Aid Not Allowed"},"No",0,0]
["Select","-","-","-","-","DD/MM/YYYY","DD/MM/YYYY","Select","Select",{"$f":"VLOOKUP(Table1[[#This Row],[DCYF Case Region]],'Drop Down'!$F$3:$G$9,2,0)","v":"Select"},"Select","Select","Select",{"$f":"IFERROR(IF(M345=\"No\",INDEX(IndexMatch!C:C,MATCH(1,(IndexMatch!A:A=VLOOKUP(H345,'Drop Down'!K:L,2,0))*(IndexMatch!B:B=L345),0)),\"Service Already Opened\"),\"N/A\")","v":"Service Already Opened"},0,{"$f":"IF(O345>VLOOKUP(L345,'Drop Down'!$A$3:$B$10,2,0),\"1\",\"0\")","v":"0"},0,{"$f":"SUM(Table1[[#This Row],[Case Aide Hours]],Table1[[#This Row],[Case Aide Travel Time]])","v":0},{"$f":"IFERROR(IF(OR(Table1[[#This Row],[Child Support Level]]=\"Support Services Lvl 1\", Table1[[#This Row],[Child Support Level]]=\"Support Services Lvl 2\",Table1[[#This Row],[Child Support Level]]=\"Select\"),\"Case Aid Not Allowed\", PRODUCT(Table1[[#This Row],[Total Case Aide]],VLOOKUP(Table1[[#This Row],[County Where Youth Resides]],'Drop Down'!K:M,3,0))),\"0\")","v":"Case Aid Not Allowed"},"No",0,0]
["Select","-","-","-","-","DD/MM/YYYY","DD/MM/YYYY","Select","Select",{"$f":"VLOOKUP(Table1[[#This Row],[DCYF Case Region]],'Drop Down'!$F$3:$G$9,2,0)","v":"Select"},"Select","Select","Select",{"$f":"IFERROR(IF(M346=\"No\",INDEX(IndexMatch!C:C,MATCH(1,(IndexMatch!A:A=VLOOKUP(H346,'Drop Down'!K:L,2,0))*(IndexMatch!B:B=L346),0)),\"Service Already Opened\"),\"N/A\")","v":"Service Already Opened"},0,{"$f":"IF(O346>VLOOKUP(L346,'Drop Down'!$A$3:$B$10,2,0),\"1\",\"0\")","v":"0"},0,{"$f":"SUM(Table1[[#This Row],[Case Aide Hours]],Table1[[#This Row],[Case Aide Travel Time]])","v":0},{"$f":"IFERROR(IF(OR(Table1[[#This Row],[Child Support Level]]=\"Support Services Lvl 1\", Table1[[#This Row],[Child Support Level]]=\"Support Services Lvl 2\",Table1[[#This Row],[Child Support Level]]=\"Select\"),\"Case Aid Not Allowed\", PRODUCT(Table1[[#This Row],[Total Case Aide]],VLOOKUP(Table1[[#This Row],[County Where Youth Resides]],'Drop Down'!K:M,3,0))),\"0\")","v":"Case Aid Not Allowed"},"No",0,0]
["Select","-","-","-","-","DD/MM/YYYY","DD/MM/YYYY","Select","Select",{"$f":"VLOOKUP(Table1[[#This Row],[DCYF Case Region]],'Drop Down'!$F$3:$G$9,2,0)","v":"Select"},"Select","Select","Select",{"$f":"IFERROR(IF(M347=\"No\",INDEX(IndexMatch!C:C,MATCH(1,(IndexMatch!A:A=VLOOKUP(H347,'Drop Down'!K:L,2,0))*(IndexMatch!B:B=L347),0)),\"Service Already Opened\"),\"N/A\")","v":"Service Already Opened"},0,{"$f":"IF(O347>VLOOKUP(L347,'Drop Down'!$A$3:$B$10,2,0),\"1\",\"0\")","v":"0"},0,{"$f":"SUM(Table1[[#This Row],[Case Aide Hours]],Table1[[#This Row],[Case Aide Travel Time]])","v":0},{"$f":"IFERROR(IF(OR(Table1[[#This Row],[Child Support Level]]=\"Support Services Lvl 1\", Table1[[#This Row],[Child Support Level]]=\"Support Services Lvl 2\",Table1[[#This Row],[Child Support Level]]=\"Select\"),\"Case Aid Not Allowed\", PRODUCT(Table1[[#This Row],[Total Case Aide]],VLOOKUP(Table1[[#This Row],[County Where Youth Resides]],'Drop Down'!K:M,3,0))),\"0\")","v":"Case Aid Not Allowed"},"No",0,0]
["Select","-","-","-","-","DD/MM/YYYY","DD/MM/YYYY","Select","Select",{"$f":"VLOOKUP(Table1[[#This Row],[DCYF Case Region]],'Drop Down'!$F$3:$G$9,2,0)","v":"Select"},"Select","Select","Select",{"$f":"IFERROR(IF(M348=\"No\",INDEX(IndexMatch!C:C,MATCH(1,(IndexMatch!A:A=VLOOKUP(H348,'Drop Down'!K:L,2,0))*(IndexMatch!B:B=L348),0)),\"Service Already Opened\"),\"N/A\")","v":"Service Already Opened"},0,{"$f":"IF(O348>VLOOKUP(L348,'Drop Down'!$A$3:$B$10,2,0),\"1\",\"0\")","v":"0"},0,{"$f":"SUM(Table1[[#This Row],[Case Aide Hours]],Table1[[#This Row],[Case Aide Travel Time]])","v":0},{"$f":"IFERROR(IF(OR(Table1[[#This Row],[Child Support Level]]=\"Support Services Lvl 1\", Table1[[#This Row],[Child Support Level]]=\"Support Services Lvl 2\",Table1[[#This Row],[Child Support Level]]=\"Select\"),\"Case Aid Not Allowed\", PRODUCT(Table1[[#This Row],[Total Case Aide]],VLOOKUP(Table1[[#This Row],[County Where Youth Resides]],'Drop Down'!K:M,3,0))),\"0\")","v":"Case Aid Not Allowed"},"No",0,0]
["Select","-","-","-","-","DD/MM/YYYY","DD/MM/YYYY","Select","Select",{"$f":"VLOOKUP(Table1[[#This Row],[DCYF Case Region]],'Drop Down'!$F$3:$G$9,2,0)","v":"Select"},"Select","Select","Select",{"$f":"IFERROR(IF(M349=\"No\",INDEX(IndexMatch!C:C,MATCH(1,(IndexMatch!A:A=VLOOKUP(H349,'Drop Down'!K:L,2,0))*(IndexMatch!B:B=L349),0)),\"Service Already Opened\"),\"N/A\")","v":"Service Already Opened"},0,{"$f":"IF(O349>VLOOKUP(L349,'Drop Down'!$A$3:$B$10,2,0),\"1\",\"0\")","v":"0"},0,{"$f":"SUM(Table1[[#This Row],[Case Aide Hours]],Table1[[#This Row],[Case Aide Travel Time]])","v":0},{"$f":"IFERROR(IF(OR(Table1[[#This Row],[Child Support Level]]=\"Support Services Lvl 1\", Table1[[#This Row],[Child Support Level]]=\"Support Services Lvl 2\",Table1[[#This Row],[Child Support Level]]=\"Select\"),\"Case Aid Not Allowed\", PRODUCT(Table1[[#This Row],[Total Case Aide]],VLOOKUP(Table1[[#This Row],[County Where Youth Resides]],'Drop Down'!K:M,3,0))),\"0\")","v":"Case Aid Not Allowed"},"No",0,0]
["Select","-","-","-","-","DD/MM/YYYY","DD/MM/YYYY","Select","Select",{"$f":"VLOOKUP(Table1[[#This Row],[DCYF Case Region]],'Drop Down'!$F$3:$G$9,2,0)","v":"Select"},"Select","Select","Select",{"$f":"IFERROR(IF(M350=\"No\",INDEX(IndexMatch!C:C,MATCH(1,(IndexMatch!A:A=VLOOKUP(H350,'Drop Down'!K:L,2,0))*(IndexMatch!B:B=L350),0)),\"Service Already Opened\"),\"N/A\")","v":"Service Already Opened"},0,{"$f":"IF(O350>VLOOKUP(L350,'Drop Down'!$A$3:$B$10,2,0),\"1\",\"0\")","v":"0"},0,{"$f":"SUM(Table1[[#This Row],[Case Aide Hours]],Table1[[#This Row],[Case Aide Travel Time]])","v":0},{"$f":"IFERROR(IF(OR(Table1[[#This Row],[Child Support Level]]=\"Support Services Lvl 1\", Table1[[#This Row],[Child Support Level]]=\"Support Services Lvl 2\",Table1[[#This Row],[Child Support Level]]=\"Select\"),\"Case Aid Not Allowed\", PRODUCT(Table1[[#This Row],[Total Case Aide]],VLOOKUP(Table1[[#This Row],[County Where Youth Resides]],'Drop Down'!K:M,3,0))),\"0\")","v":"Case Aid Not Allowed"},"No",0,0]
["Select","-","-","-","-","DD/MM/YYYY","DD/MM/YYYY","Select","Select",{"$f":"VLOOKUP(Table1[[#This Row],[DCYF Case Region]],'Drop Down'!$F$3:$G$9,2,0)","v":"Select"},"Select","Select","Select",{"$f":"IFERROR(IF(M351=\"No\",INDEX(IndexMatch!C:C,MATCH(1,(IndexMatch!A:A=VLOOKUP(H351,'Drop Down'!K:L,2,0))*(IndexMatch!B:B=L351),0)),\"Service Already Opened\"),\"N/A\")","v":"Service Already Opened"},0,{"$f":"IF(O351>VLOOKUP(L351,'Drop Down'!$A$3:$B$10,2,0),\"1\",\"0\")","v":"0"},0,{"$f":"SUM(Table1[[#This Row],[Case Aide Hours]],Table1[[#This Row],[Case Aide Travel Time]])","v":0},{"$f":"IFERROR(IF(OR(Table1[[#This Row],[Child Support Level]]=\"Support Services Lvl 1\", Table1[[#This Row],[Child Support Level]]=\"Support Services Lvl 2\",Table1[[#This Row],[Child Support Level]]=\"Select\"),\"Case Aid Not Allowed\", PRODUCT(Table1[[#This Row],[Total Case Aide]],VLOOKUP(Table1[[#This Row],[County Where Youth Resides]],'Drop Down'!K:M,3,0))),\"0\")","v":"Case Aid Not Allowed"},"No",0,0]
["Select","-","-","-","-","DD/MM/YYYY","DD/MM/YYYY","Select","Select",{"$f":"VLOOKUP(Table1[[#This Row],[DCYF Case Region]],'Drop Down'!$F$3:$G$9,2,0)","v":"Select"},"Select","Select","Select",{"$f":"IFERROR(IF(M352=\"No\",INDEX(IndexMatch!C:C,MATCH(1,(IndexMatch!A:A=VLOOKUP(H352,'Drop Down'!K:L,2,0))*(IndexMatch!B:B=L352),0)),\"Service Already Opened\"),\"N/A\")","v":"Service Already Opened"},0,{"$f":"IF(O352>VLOOKUP(L352,'Drop Down'!$A$3:$B$10,2,0),\"1\",\"0\")","v":"0"},0,{"$f":"SUM(Table1[[#This Row],[Case Aide Hours]],Table1[[#This Row],[Case Aide Travel Time]])","v":0},{"$f":"IFERROR(IF(OR(Table1[[#This Row],[Child Support Level]]=\"Support Services Lvl 1\", Table1[[#This Row],[Child Support Level]]=\"Support Services Lvl 2\",Table1[[#This Row],[Child Support Level]]=\"Select\"),\"Case Aid Not Allowed\", PRODUCT(Table1[[#This Row],[Total Case Aide]],VLOOKUP(Table1[[#This Row],[County Where Youth Resides]],'Drop Down'!K:M,3,0))),\"0\")","v":"Case Aid Not Allowed"},"No",0,0]
["Select","-","-","-","-","DD/MM/YYYY","DD/MM/YYYY","Select","Select",{"$f":"VLOOKUP(Table1[[#This Row],[DCYF Case Region]],'Drop Down'!$F$3:$G$9,2,0)","v":"Select"},"Select","Select","Select",{"$f":"IFERROR(IF(M353=\"No\",INDEX(IndexMatch!C:C,MATCH(1,(IndexMatch!A:A=VLOOKUP(H353,'Drop Down'!K:L,2,0))*(IndexMatch!B:B=L353),0)),\"Service Already Opened\"),\"N/A\")","v":"Service Already Opened"},0,{"$f":"IF(O353>VLOOKUP(L353,'Drop Down'!$A$3:$B$10,2,0),\"1\",\"0\")","v":"0"},0,{"$f":"SUM(Table1[[#This Row],[Case Aide Hours]],Table1[[#This Row],[Case Aide Travel Time]])","v":0},{"$f":"IFERROR(IF(OR(Table1[[#This Row],[Child Support Level]]=\"Support Services Lvl 1\", Table1[[#This Row],[Child Support Level]]=\"Support Services Lvl 2\",Table1[[#This Row],[Child Support Level]]=\"Select\"),\"Case Aid Not Allowed\", PRODUCT(Table1[[#This Row],[Total Case Aide]],VLOOKUP(Table1[[#This Row],[County Where Youth Resides]],'Drop Down'!K:M,3,0))),\"0\")","v":"Case Aid Not Allowed"},"No",0,0]
["Select","-","-","-","-","DD/MM/YYYY","DD/MM/YYYY","Select","Select",{"$f":"VLOOKUP(Table1[[#This Row],[DCYF Case Region]],'Drop Down'!$F$3:$G$9,2,0)","v":"Select"},"Select","Select","Select",{"$f":"IFERROR(IF(M354=\"No\",INDEX(IndexMatch!C:C,MATCH(1,(IndexMatch!A:A=VLOOKUP(H354,'Drop Down'!K:L,2,0))*(IndexMatch!B:B=L354),0)),\"Service Already Opened\"),\"N/A\")","v":"Service Already Opened"},0,{"$f":"IF(O354>VLOOKUP(L354,'Drop Down'!$A$3:$B$10,2,0),\"1\",\"0\")","v":"0"},0,{"$f":"SUM(Table1[[#This Row],[Case Aide Hours]],Table1[[#This Row],[Case Aide Travel Time]])","v":0},{"$f":"IFERROR(IF(OR(Table1[[#This Row],[Child Support Level]]=\"Support Services Lvl 1\", Table1[[#This Row],[Child Support Level]]=\"Support Services Lvl 2\",Table1[[#This Row],[Child Support Level]]=\"Select\"),\"Case Aid Not Allowed\", PRODUCT(Table1[[#This Row],[Total Case Aide]],VLOOKUP(Table1[[#This Row],[County Where Youth Resides]],'Drop Down'!K:M,3,0))),\"0\")","v":"Case Aid Not Allowed"},"No",0,0]
["Select","-","-","-","-","DD/MM/YYYY","DD/MM/YYYY","Select","Select",{"$f":"VLOOKUP(Table1[[#This Row],[DCYF Case Region]],'Drop Down'!$F$3:$G$9,2,0)","v":"Select"},"Select","Select","Select",{"$f":"IFERROR(IF(M355=\"No\",INDEX(IndexMatch!C:C,MATCH(1,(IndexMatch!A:A=VLOOKUP(H355,'Drop Down'!K:L,2,0))*(IndexMatch!B:B=L355),0)),\"Service Already Opened\"),\"N/A\")","v":"Service Already Opened"},0,{"$f":"IF(O355>VLOOKUP(L355,'Drop Down'!$A$3:$B$10,2,0),\"1\",\"0\")","v":"0"},0,{"$f":"SUM(Table1[[#This Row],[Case Aide Hours]],Table1[[#This Row],[Case Aide Travel Time]])","v":0},{"$f":"IFERROR(IF(OR(Table1[[#This Row],[Child Support Level]]=\"Support Services Lvl 1\", Table1[[#This Row],[Child Support Level]]=\"Support Services Lvl 2\",Table1[[#This Row],[Child Support Level]]=\"Select\"),\"Case Aid Not Allowed\", PRODUCT(Table1[[#This Row],[Total Case Aide]],VLOOKUP(Table1[[#This Row],[County Where Youth Resides]],'Drop Down'!K:M,3,0))),\"0\")","v":"Case Aid Not Allowed"},"No",0,0]
["Select","-","-","-","-","DD/MM/YYYY","DD/MM/YYYY","Select","Select",{"$f":"VLOOKUP(Table1[[#This Row],[DCYF Case Region]],'Drop Down'!$F$3:$G$9,2,0)","v":"Select"},"Select","Select","Select",{"$f":"IFERROR(IF(M356=\"No\",INDEX(IndexMatch!C:C,MATCH(1,(IndexMatch!A:A=VLOOKUP(H356,'Drop Down'!K:L,2,0))*(IndexMatch!B:B=L356),0)),\"Service Already Opened\"),\"N/A\")","v":"Service Already Opened"},0,{"$f":"IF(O356>VLOOKUP(L356,'Drop Down'!$A$3:$B$10,2,0),\"1\",\"0\")","v":"0"},0,{"$f":"SUM(Table1[[#This Row],[Case Aide Hours]],Table1[[#This Row],[Case Aide Travel Time]])","v":0},{"$f":"IFERROR(IF(OR(Table1[[#This Row],[Child Support Level]]=\"Support Services Lvl 1\", Table1[[#This Row],[Child Support Level]]=\"Support Services Lvl 2\",Table1[[#This Row],[Child Support Level]]=\"Select\"),\"Case Aid Not Allowed\", PRODUCT(Table1[[#This Row],[Total Case Aide]],VLOOKUP(Table1[[#This Row],[County Where Youth Resides]],'Drop Down'!K:M,3,0))),\"0\")","v":"Case Aid Not Allowed"},"No",0,0]
["Select","-","-","-","-","DD/MM/YYYY","DD/MM/YYYY","Select","Select",{"$f":"VLOOKUP(Table1[[#This Row],[DCYF Case Region]],'Drop Down'!$F$3:$G$9,2,0)","v":"Select"},"Select","Select","Select",{"$f":"IFERROR(IF(M357=\"No\",INDEX(IndexMatch!C:C,MATCH(1,(IndexMatch!A:A=VLOOKUP(H357,'Drop Down'!K:L,2,0))*(IndexMatch!B:B=L357),0)),\"Service Already Opened\"),\"N/A\")","v":"Service Already Opened"},0,{"$f":"IF(O357>VLOOKUP(L357,'Drop Down'!$A$3:$B$10,2,0),\"1\",\"0\")","v":"0"},0,{"$f":"SUM(Table1[[#This Row],[Case Aide Hours]],Table1[[#This Row],[Case Aide Travel Time]])","v":0},{"$f":"IFERROR(IF(OR(Table1[[#This Row],[Child Support Level]]=\"Support Services Lvl 1\", Table1[[#This Row],[Child Support Level]]=\"Support Services Lvl 2\",Table1[[#This Row],[Child Support Level]]=\"Select\"),\"Case Aid Not Allowed\", PRODUCT(Table1[[#This Row],[Total Case Aide]],VLOOKUP(Table1[[#This Row],[County Where Youth Resides]],'Drop Down'!K:M,3,0))),\"0\")","v":"Case Aid Not Allowed"},"No",0,0]
["Select","-","-","-","-","DD/MM/YYYY","DD/MM/YYYY","Select","Select",{"$f":"VLOOKUP(Table1[[#This Row],[DCYF Case Region]],'Drop Down'!$F$3:$G$9,2,0)","v":"Select"},"Select","Select","Select",{"$f":"IFERROR(IF(M358=\"No\",INDEX(IndexMatch!C:C,MATCH(1,(IndexMatch!A:A=VLOOKUP(H358,'Drop Down'!K:L,2,0))*(IndexMatch!B:B=L358),0)),\"Service Already Opened\"),\"N/A\")","v":"Service Already Opened"},0,{"$f":"IF(O358>VLOOKUP(L358,'Drop Down'!$A$3:$B$10,2,0),\"1\",\"0\")","v":"0"},0,{"$f":"SUM(Table1[[#This Row],[Case Aide Hours]],Table1[[#This Row],[Case Aide Travel Time]])","v":0},{"$f":"IFERROR(IF(OR(Table1[[#This Row],[Child Support Level]]=\"Support Services Lvl 1\", Table1[[#This Row],[Child Support Level]]=\"Support Services Lvl 2\",Table1[[#This Row],[Child Support Level]]=\"Select\"),\"Case Aid Not Allowed\", PRODUCT(Table1[[#This Row],[Total Case Aide]],VLOOKUP(Table1[[#This Row],[County Where Youth Resides]],'Drop Down'!K:M,3,0))),\"0\")","v":"Case Aid Not Allowed"},"No",0,0]
["Select","-","-","-","-","DD/MM/YYYY","DD/MM/YYYY","Select","Select",{"$f":"VLOOKUP(Table1[[#This Row],[DCYF Case Region]],'Drop Down'!$F$3:$G$9,2,0)","v":"Select"},"Select","Select","Select",{"$f":"IFERROR(IF(M359=\"No\",INDEX(IndexMatch!C:C,MATCH(1,(IndexMatch!A:A=VLOOKUP(H359,'Drop Down'!K:L,2,0))*(IndexMatch!B:B=L359),0)),\"Service Already Opened\"),\"N/A\")","v":"Service Already Opened"},0,{"$f":"IF(O359>VLOOKUP(L359,'Drop Down'!$A$3:$B$10,2,0),\"1\",\"0\")","v":"0"},0,{"$f":"SUM(Table1[[#This Row],[Case Aide Hours]],Table1[[#This Row],[Case Aide Travel Time]])","v":0},{"$f":"IFERROR(IF(OR(Table1[[#This Row],[Child Support Level]]=\"Support Services Lvl 1\", Table1[[#This Row],[Child Support Level]]=\"Support Services Lvl 2\",Table1[[#This Row],[Child Support Level]]=\"Select\"),\"Case Aid Not Allowed\", PRODUCT(Table1[[#This Row],[Total Case Aide]],VLOOKUP(Table1[[#This Row],[County Where Youth Resides]],'Drop Down'!K:M,3,0))),\"0\")","v":"Case Aid Not Allowed"},"No",0,0]
["Select","-","-","-","-","DD/MM/YYYY","DD/MM/YYYY","Select","Select",{"$f":"VLOOKUP(Table1[[#This Row],[DCYF Case Region]],'Drop Down'!$F$3:$G$9,2,0)","v":"Select"},"Select","Select","Select",{"$f":"IFERROR(IF(M360=\"No\",INDEX(IndexMatch!C:C,MATCH(1,(IndexMatch!A:A=VLOOKUP(H360,'Drop Down'!K:L,2,0))*(IndexMatch!B:B=L360),0)),\"Service Already Opened\"),\"N/A\")","v":"Service Already Opened"},0,{"$f":"IF(O360>VLOOKUP(L360,'Drop Down'!$A$3:$B$10,2,0),\"1\",\"0\")","v":"0"},0,{"$f":"SUM(Table1[[#This Row],[Case Aide Hours]],Table1[[#This Row],[Case Aide Travel Time]])","v":0},{"$f":"IFERROR(IF(OR(Table1[[#This Row],[Child Support Level]]=\"Support Services Lvl 1\", Table1[[#This Row],[Child Support Level]]=\"Support Services Lvl 2\",Table1[[#This Row],[Child Support Level]]=\"Select\"),\"Case Aid Not Allowed\", PRODUCT(Table1[[#This Row],[Total Case Aide]],VLOOKUP(Table1[[#This Row],[County Where Youth Resides]],'Drop Down'!K:M,3,0))),\"0\")","v":"Case Aid Not Allowed"},"No",0,0]
["Select","-","-","-","-","DD/MM/YYYY","DD/MM/YYYY","Select","Select",{"$f":"VLOOKUP(Table1[[#This Row],[DCYF Case Region]],'Drop Down'!$F$3:$G$9,2,0)","v":"Select"},"Select","Select","Select",{"$f":"IFERROR(IF(M361=\"No\",INDEX(IndexMatch!C:C,MATCH(1,(IndexMatch!A:A=VLOOKUP(H361,'Drop Down'!K:L,2,0))*(IndexMatch!B:B=L361),0)),\"Service Already Opened\"),\"N/A\")","v":"Service Already Opened"},0,{"$f":"IF(O361>VLOOKUP(L361,'Drop Down'!$A$3:$B$10,2,0),\"1\",\"0\")","v":"0"},0,{"$f":"SUM(Table1[[#This Row],[Case Aide Hours]],Table1[[#This Row],[Case Aide Travel Time]])","v":0},{"$f":"IFERROR(IF(OR(Table1[[#This Row],[Child Support Level]]=\"Support Services Lvl 1\", Table1[[#This Row],[Child Support Level]]=\"Support Services Lvl 2\",Table1[[#This Row],[Child Support Level]]=\"Select\"),\"Case Aid Not Allowed\", PRODUCT(Table1[[#This Row],[Total Case Aide]],VLOOKUP(Table1[[#This Row],[County Where Youth Resides]],'Drop Down'!K:M,3,0))),\"0\")","v":"Case Aid Not Allowed"},"No",0,0]
["Select","-","-","-","-","DD/MM/YYYY","DD/MM/YYYY","Select","Select",{"$f":"VLOOKUP(Table1[[#This Row],[DCYF Case Region]],'Drop Down'!$F$3:$G$9,2,0)","v":"Select"},"Select","Select","Select",{"$f":"IFERROR(IF(M362=\"No\",INDEX(IndexMatch!C:C,MATCH(1,(IndexMatch!A:A=VLOOKUP(H362,'Drop Down'!K:L,2,0))*(IndexMatch!B:B=L362),0)),\"Service Already Opened\"),\"N/A\")","v":"Service Already Opened"},0,{"$f":"IF(O362>VLOOKUP(L362,'Drop Down'!$A$3:$B$10,2,0),\"1\",\"0\")","v":"0"},0,{"$f":"SUM(Table1[[#This Row],[Case Aide Hours]],Table1[[#This Row],[Case Aide Travel Time]])","v":0},{"$f":"IFERROR(IF(OR(Table1[[#This Row],[Child Support Level]]=\"Support Services Lvl 1\", Table1[[#This Row],[Child Support Level]]=\"Support Services Lvl 2\",Table1[[#This Row],[Child Support Level]]=\"Select\"),\"Case Aid Not Allowed\", PRODUCT(Table1[[#This Row],[Total Case Aide]],VLOOKUP(Table1[[#This Row],[County Where Youth Resides]],'Drop Down'!K:M,3,0))),\"0\")","v":"Case Aid Not Allowed"},"No",0,0]
["Select","-","-","-","-","DD/MM/YYYY","DD/MM/YYYY","Select","Select",{"$f":"VLOOKUP(Table1[[#This Row],[DCYF Case Region]],'Drop Down'!$F$3:$G$9,2,0)","v":"Select"},"Select","Select","Select",{"$f":"IFERROR(IF(M363=\"No\",INDEX(IndexMatch!C:C,MATCH(1,(IndexMatch!A:A=VLOOKUP(H363,'Drop Down'!K:L,2,0))*(IndexMatch!B:B=L363),0)),\"Service Already Opened\"),\"N/A\")","v":"Service Already Opened"},0,{"$f":"IF(O363>VLOOKUP(L363,'Drop Down'!$A$3:$B$10,2,0),\"1\",\"0\")","v":"0"},0,{"$f":"SUM(Table1[[#This Row],[Case Aide Hours]],Table1[[#This Row],[Case Aide Travel Time]])","v":0},{"$f":"IFERROR(IF(OR(Table1[[#This Row],[Child Support Level]]=\"Support Services Lvl 1\", Table1[[#This Row],[Child Support Level]]=\"Support Services Lvl 2\",Table1[[#This Row],[Child Support Level]]=\"Select\"),\"Case Aid Not Allowed\", PRODUCT(Table1[[#This Row],[Total Case Aide]],VLOOKUP(Table1[[#This Row],[County Where Youth Resides]],'Drop Down'!K:M,3,0))),\"0\")","v":"Case Aid Not Allowed"},"No",0,0]
["Select","-","-","-","-","DD/MM/YYYY","DD/MM/YYYY","Select","Select",{"$f":"VLOOKUP(Table1[[#This Row],[DCYF Case Region]],'Drop Down'!$F$3:$G$9,2,0)","v":"Select"},"Select","Select","Select",{"$f":"IFERROR(IF(M364=\"No\",INDEX(IndexMatch!C:C,MATCH(1,(IndexMatch!A:A=VLOOKUP(H364,'Drop Down'!K:L,2,0))*(IndexMatch!B:B=L364),0)),\"Service Already Opened\"),\"N/A\")","v":"Service Already Opened"},0,{"$f":"IF(O364>VLOOKUP(L364,'Drop Down'!$A$3:$B$10,2,0),\"1\",\"0\")","v":"0"},0,{"$f":"SUM(Table1[[#This Row],[Case Aide Hours]],Table1[[#This Row],[Case Aide Travel Time]])","v":0},{"$f":"IFERROR(IF(OR(Table1[[#This Row],[Child Support Level]]=\"Support Services Lvl 1\", Table1[[#This Row],[Child Support Level]]=\"Support Services Lvl 2\",Table1[[#This Row],[Child Support Level]]=\"Select\"),\"Case Aid Not Allowed\", PRODUCT(Table1[[#This Row],[Total Case Aide]],VLOOKUP(Table1[[#This Row],[County Where Youth Resides]],'Drop Down'!K:M,3,0))),\"0\")","v":"Case Aid Not Allowed"},"No",0,0]
["Select","-","-","-","-","DD/MM/YYYY","DD/MM/YYYY","Select","Select",{"$f":"VLOOKUP(Table1[[#This Row],[DCYF Case Region]],'Drop Down'!$F$3:$G$9,2,0)","v":"Select"},"Select","Select","Select",{"$f":"IFERROR(IF(M365=\"No\",INDEX(IndexMatch!C:C,MATCH(1,(IndexMatch!A:A=VLOOKUP(H365,'Drop Down'!K:L,2,0))*(IndexMatch!B:B=L365),0)),\"Service Already Opened\"),\"N/A\")","v":"Service Already Opened"},0,{"$f":"IF(O365>VLOOKUP(L365,'Drop Down'!$A$3:$B$10,2,0),\"1\",\"0\")","v":"0"},0,{"$f":"SUM(Table1[[#This Row],[Case Aide Hours]],Table1[[#This Row],[Case Aide Travel Time]])","v":0},{"$f":"IFERROR(IF(OR(Table1[[#This Row],[Child Support Level]]=\"Support Services Lvl 1\", Table1[[#This Row],[Child Support Level]]=\"Support Services Lvl 2\",Table1[[#This Row],[Child Support Level]]=\"Select\"),\"Case Aid Not Allowed\", PRODUCT(Table1[[#This Row],[Total Case Aide]],VLOOKUP(Table1[[#This Row],[County Where Youth Resides]],'Drop Down'!K:M,3,0))),\"0\")","v":"Case Aid Not Allowed"},"No",0,0]
["Select","-","-","-","-","DD/MM/YYYY","DD/MM/YYYY","Select","Select",{"$f":"VLOOKUP(Table1[[#This Row],[DCYF Case Region]],'Drop Down'!$F$3:$G$9,2,0)","v":"Select"},"Select","Select","Select",{"$f":"IFERROR(IF(M366=\"No\",INDEX(IndexMatch!C:C,MATCH(1,(IndexMatch!A:A=VLOOKUP(H366,'Drop Down'!K:L,2,0))*(IndexMatch!B:B=L366),0)),\"Service Already Opened\"),\"N/A\")","v":"Service Already Opened"},0,{"$f":"IF(O366>VLOOKUP(L366,'Drop Down'!$A$3:$B$10,2,0),\"1\",\"0\")","v":"0"},0,{"$f":"SUM(Table1[[#This Row],[Case Aide Hours]],Table1[[#This Row],[Case Aide Travel Time]])","v":0},{"$f":"IFERROR(IF(OR(Table1[[#This Row],[Child Support Level]]=\"Support Services Lvl 1\", Table1[[#This Row],[Child Support Level]]=\"Support Services Lvl 2\",Table1[[#This Row],[Child Support Level]]=\"Select\"),\"Case Aid Not Allowed\", PRODUCT(Table1[[#This Row],[Total Case Aide]],VLOOKUP(Table1[[#This Row],[County Where Youth Resides]],'Drop Down'!K:M,3,0))),\"0\")","v":"Case Aid Not Allowed"},"No",0,0]
["Select","-","-","-","-","DD/MM/YYYY","DD/MM/YYYY","Select","Select",{"$f":"VLOOKUP(Table1[[#This Row],[DCYF Case Region]],'Drop Down'!$F$3:$G$9,2,0)","v":"Select"},"Select","Select","Select",{"$f":"IFERROR(IF(M367=\"No\",INDEX(IndexMatch!C:C,MATCH(1,(IndexMatch!A:A=VLOOKUP(H367,'Drop Down'!K:L,2,0))*(IndexMatch!B:B=L367),0)),\"Service Already Opened\"),\"N/A\")","v":"Service Already Opened"},0,{"$f":"IF(O367>VLOOKUP(L367,'Drop Down'!$A$3:$B$10,2,0),\"1\",\"0\")","v":"0"},0,{"$f":"SUM(Table1[[#This Row],[Case Aide Hours]],Table1[[#This Row],[Case Aide Travel Time]])","v":0},{"$f":"IFERROR(IF(OR(Table1[[#This Row],[Child Support Level]]=\"Support Services Lvl 1\", Table1[[#This Row],[Child Support Level]]=\"Support Services Lvl 2\",Table1[[#This Row],[Child Support Level]]=\"Select\"),\"Case Aid Not Allowed\", PRODUCT(Table1[[#This Row],[Total Case Aide]],VLOOKUP(Table1[[#This Row],[County Where Youth Resides]],'Drop Down'!K:M,3,0))),\"0\")","v":"Case Aid Not Allowed"},"No",0,0]
["Select","-","-","-","-","DD/MM/YYYY","DD/MM/YYYY","Select","Select",{"$f":"VLOOKUP(Table1[[#This Row],[DCYF Case Region]],'Drop Down'!$F$3:$G$9,2,0)","v":"Select"},"Select","Select","Select",{"$f":"IFERROR(IF(M368=\"No\",INDEX(IndexMatch!C:C,MATCH(1,(IndexMatch!A:A=VLOOKUP(H368,'Drop Down'!K:L,2,0))*(IndexMatch!B:B=L368),0)),\"Service Already Opened\"),\"N/A\")","v":"Service Already Opened"},0,{"$f":"IF(O368>VLOOKUP(L368,'Drop Down'!$A$3:$B$10,2,0),\"1\",\"0\")","v":"0"},0,{"$f":"SUM(Table1[[#This Row],[Case Aide Hours]],Table1[[#This Row],[Case Aide Travel Time]])","v":0},{"$f":"IFERROR(IF(OR(Table1[[#This Row],[Child Support Level]]=\"Support Services Lvl 1\", Table1[[#This Row],[Child Support Level]]=\"Support Services Lvl 2\",Table1[[#This Row],[Child Support Level]]=\"Select\"),\"Case Aid Not Allowed\", PRODUCT(Table1[[#This Row],[Total Case Aide]],VLOOKUP(Table1[[#This Row],[County Where Youth Resides]],'Drop Down'!K:M,3,0))),\"0\")","v":"Case Aid Not Allowed"},"No",0,0]
["Select","-","-","-","-","DD/MM/YYYY","DD/MM/YYYY","Select","Select",{"$f":"VLOOKUP(Table1[[#This Row],[DCYF Case Region]],'Drop Down'!$F$3:$G$9,2,0)","v":"Select"},"Select","Select","Select",{"$f":"IFERROR(IF(M369=\"No\",INDEX(IndexMatch!C:C,MATCH(1,(IndexMatch!A:A=VLOOKUP(H369,'Drop Down'!K:L,2,0))*(IndexMatch!B:B=L369),0)),\"Service Already Opened\"),\"N/A\")","v":"Service Already Opened"},0,{"$f":"IF(O369>VLOOKUP(L369,'Drop Down'!$A$3:$B$10,2,0),\"1\",\"0\")","v":"0"},0,{"$f":"SUM(Table1[[#This Row],[Case Aide Hours]],Table1[[#This Row],[Case Aide Travel Time]])","v":0},{"$f":"IFERROR(IF(OR(Table1[[#This Row],[Child Support Level]]=\"Support Services Lvl 1\", Table1[[#This Row],[Child Support Level]]=\"Support Services Lvl 2\",Table1[[#This Row],[Child Support Level]]=\"Select\"),\"Case Aid Not Allowed\", PRODUCT(Table1[[#This Row],[Total Case Aide]],VLOOKUP(Table1[[#This Row],[County Where Youth Resides]],'Drop Down'!K:M,3,0))),\"0\")","v":"Case Aid Not Allowed"},"No",0,0]
["Select","-","-","-","-","DD/MM/YYYY","DD/MM/YYYY","Select","Select",{"$f":"VLOOKUP(Table1[[#This Row],[DCYF Case Region]],'Drop Down'!$F$3:$G$9,2,0)","v":"Select"},"Select","Select","Select",{"$f":"IFERROR(IF(M370=\"No\",INDEX(IndexMatch!C:C,MATCH(1,(IndexMatch!A:A=VLOOKUP(H370,'Drop Down'!K:L,2,0))*(IndexMatch!B:B=L370),0)),\"Service Already Opened\"),\"N/A\")","v":"Service Already Opened"},0,{"$f":"IF(O370>VLOOKUP(L370,'Drop Down'!$A$3:$B$10,2,0),\"1\",\"0\")","v":"0"},0,{"$f":"SUM(Table1[[#This Row],[Case Aide Hours]],Table1[[#This Row],[Case Aide Travel Time]])","v":0},{"$f":"IFERROR(IF(OR(Table1[[#This Row],[Child Support Level]]=\"Support Services Lvl 1\", Table1[[#This Row],[Child Support Level]]=\"Support Services Lvl 2\",Table1[[#This Row],[Child Support Level]]=\"Select\"),\"Case Aid Not Allowed\", PRODUCT(Table1[[#This Row],[Total Case Aide]],VLOOKUP(Table1[[#This Row],[County Where Youth Resides]],'Drop Down'!K:M,3,0))),\"0\")","v":"Case Aid Not Allowed"},"No",0,0]
["Select","-","-","-","-","DD/MM/YYYY","DD/MM/YYYY","Select","Select",{"$f":"VLOOKUP(Table1[[#This Row],[DCYF Case Region]],'Drop Down'!$F$3:$G$9,2,0)","v":"Select"},"Select","Select","Select",{"$f":"IFERROR(IF(M371=\"No\",INDEX(IndexMatch!C:C,MATCH(1,(IndexMatch!A:A=VLOOKUP(H371,'Drop Down'!K:L,2,0))*(IndexMatch!B:B=L371),0)),\"Service Already Opened\"),\"N/A\")","v":"Service Already Opened"},0,{"$f":"IF(O371>VLOOKUP(L371,'Drop Down'!$A$3:$B$10,2,0),\"1\",\"0\")","v":"0"},0,{"$f":"SUM(Table1[[#This Row],[Case Aide Hours]],Table1[[#This Row],[Case Aide Travel Time]])","v":0},{"$f":"IFERROR(IF(OR(Table1[[#This Row],[Child Support Level]]=\"Support Services Lvl 1\", Table1[[#This Row],[Child Support Level]]=\"Support Services Lvl 2\",Table1[[#This Row],[Child Support Level]]=\"Select\"),\"Case Aid Not Allowed\", PRODUCT(Table1[[#This Row],[Total Case Aide]],VLOOKUP(Table1[[#This Row],[County Where Youth Resides]],'Drop Down'!K:M,3,0))),\"0\")","v":"Case Aid Not Allowed"},"No",0,0]
["Select","-","-","-","-","DD/MM/YYYY","DD/MM/YYYY","Select","Select",{"$f":"VLOOKUP(Table1[[#This Row],[DCYF Case Region]],'Drop Down'!$F$3:$G$9,2,0)","v":"Select"},"Select","Select","Select",{"$f":"IFERROR(IF(M372=\"No\",INDEX(IndexMatch!C:C,MATCH(1,(IndexMatch!A:A=VLOOKUP(H372,'Drop Down'!K:L,2,0))*(IndexMatch!B:B=L372),0)),\"Service Already Opened\"),\"N/A\")","v":"Service Already Opened"},0,{"$f":"IF(O372>VLOOKUP(L372,'Drop Down'!$A$3:$B$10,2,0),\"1\",\"0\")","v":"0"},0,{"$f":"SUM(Table1[[#This Row],[Case Aide Hours]],Table1[[#This Row],[Case Aide Travel Time]])","v":0},{"$f":"IFERROR(IF(OR(Table1[[#This Row],[Child Support Level]]=\"Support Services Lvl 1\", Table1[[#This Row],[Child Support Level]]=\"Support Services Lvl 2\",Table1[[#This Row],[Child Support Level]]=\"Select\"),\"Case Aid Not Allowed\", PRODUCT(Table1[[#This Row],[Total Case Aide]],VLOOKUP(Table1[[#This Row],[County Where Youth Resides]],'Drop Down'!K:M,3,0))),\"0\")","v":"Case Aid Not Allowed"},"No",0,0]
["Select","-","-","-","-","DD/MM/YYYY","DD/MM/YYYY","Select","Select",{"$f":"VLOOKUP(Table1[[#This Row],[DCYF Case Region]],'Drop Down'!$F$3:$G$9,2,0)","v":"Select"},"Select","Select","Select",{"$f":"IFERROR(IF(M373=\"No\",INDEX(IndexMatch!C:C,MATCH(1,(IndexMatch!A:A=VLOOKUP(H373,'Drop Down'!K:L,2,0))*(IndexMatch!B:B=L373),0)),\"Service Already Opened\"),\"N/A\")","v":"Service Already Opened"},0,{"$f":"IF(O373>VLOOKUP(L373,'Drop Down'!$A$3:$B$10,2,0),\"1\",\"0\")","v":"0"},0,{"$f":"SUM(Table1[[#This Row],[Case Aide Hours]],Table1[[#This Row],[Case Aide Travel Time]])","v":0},{"$f":"IFERROR(IF(OR(Table1[[#This Row],[Child Support Level]]=\"Support Services Lvl 1\", Table1[[#This Row],[Child Support Level]]=\"Support Services Lvl 2\",Table1[[#This Row],[Child Support Level]]=\"Select\"),\"Case Aid Not Allowed\", PRODUCT(Table1[[#This Row],[Total Case Aide]],VLOOKUP(Table1[[#This Row],[County Where Youth Resides]],'Drop Down'!K:M,3,0))),\"0\")","v":"Case Aid Not Allowed"},"No",0,0]
["Select","-","-","-","-","DD/MM/YYYY","DD/MM/YYYY","Select","Select",{"$f":"VLOOKUP(Table1[[#This Row],[DCYF Case Region]],'Drop Down'!$F$3:$G$9,2,0)","v":"Select"},"Select","Select","Select",{"$f":"IFERROR(IF(M374=\"No\",INDEX(IndexMatch!C:C,MATCH(1,(IndexMatch!A:A=VLOOKUP(H374,'Drop Down'!K:L,2,0))*(IndexMatch!B:B=L374),0)),\"Service Already Opened\"),\"N/A\")","v":"Service Already Opened"},0,{"$f":"IF(O374>VLOOKUP(L374,'Drop Down'!$A$3:$B$10,2,0),\"1\",\"0\")","v":"0"},0,{"$f":"SUM(Table1[[#This Row],[Case Aide Hours]],Table1[[#This Row],[Case Aide Travel Time]])","v":0},{"$f":"IFERROR(IF(OR(Table1[[#This Row],[Child Support Level]]=\"Support Services Lvl 1\", Table1[[#This Row],[Child Support Level]]=\"Support Services Lvl 2\",Table1[[#This Row],[Child Support Level]]=\"Select\"),\"Case Aid Not Allowed\", PRODUCT(Table1[[#This Row],[Total Case Aide]],VLOOKUP(Table1[[#This Row],[County Where Youth Resides]],'Drop Down'!K:M,3,0))),\"0\")","v":"Case Aid Not Allowed"},"No",0,0]
["Select","-","-","-","-","DD/MM/YYYY","DD/MM/YYYY","Select","Select",{"$f":"VLOOKUP(Table1[[#This Row],[DCYF Case Region]],'Drop Down'!$F$3:$G$9,2,0)","v":"Select"},"Select","Select","Select",{"$f":"IFERROR(IF(M375=\"No\",INDEX(IndexMatch!C:C,MATCH(1,(IndexMatch!A:A=VLOOKUP(H375,'Drop Down'!K:L,2,0))*(IndexMatch!B:B=L375),0)),\"Service Already Opened\"),\"N/A\")","v":"Service Already Opened"},0,{"$f":"IF(O375>VLOOKUP(L375,'Drop Down'!$A$3:$B$10,2,0),\"1\",\"0\")","v":"0"},0,{"$f":"SUM(Table1[[#This Row],[Case Aide Hours]],Table1[[#This Row],[Case Aide Travel Time]])","v":0},{"$f":"IFERROR(IF(OR(Table1[[#This Row],[Child Support Level]]=\"Support Services Lvl 1\", Table1[[#This Row],[Child Support Level]]=\"Support Services Lvl 2\",Table1[[#This Row],[Child Support Level]]=\"Select\"),\"Case Aid Not Allowed\", PRODUCT(Table1[[#This Row],[Total Case Aide]],VLOOKUP(Table1[[#This Row],[County Where Youth Resides]],'Drop Down'!K:M,3,0))),\"0\")","v":"Case Aid Not Allowed"},"No",0,0]
["Select","-","-","-","-","DD/MM/YYYY","DD/MM/YYYY","Select","Select",{"$f":"VLOOKUP(Table1[[#This Row],[DCYF Case Region]],'Drop Down'!$F$3:$G$9,2,0)","v":"Select"},"Select","Select","Select",{"$f":"IFERROR(IF(M376=\"No\",INDEX(IndexMatch!C:C,MATCH(1,(IndexMatch!A:A=VLOOKUP(H376,'Drop Down'!K:L,2,0))*(IndexMatch!B:B=L376),0)),\"Service Already Opened\"),\"N/A\")","v":"Service Already Opened"},0,{"$f":"IF(O376>VLOOKUP(L376,'Drop Down'!$A$3:$B$10,2,0),\"1\",\"0\")","v":"0"},0,{"$f":"SUM(Table1[[#This Row],[Case Aide Hours]],Table1[[#This Row],[Case Aide Travel Time]])","v":0},{"$f":"IFERROR(IF(OR(Table1[[#This Row],[Child Support Level]]=\"Support Services Lvl 1\", Table1[[#This Row],[Child Support Level]]=\"Support Services Lvl 2\",Table1[[#This Row],[Child Support Level]]=\"Select\"),\"Case Aid Not Allowed\", PRODUCT(Table1[[#This Row],[Total Case Aide]],VLOOKUP(Table1[[#This Row],[County Where Youth Resides]],'Drop Down'!K:M,3,0))),\"0\")","v":"Case Aid Not Allowed"},"No",0,0]
["Select","-","-","-","-","DD/MM/YYYY","DD/MM/YYYY","Select","Select",{"$f":"VLOOKUP(Table1[[#This Row],[DCYF Case Region]],'Drop Down'!$F$3:$G$9,2,0)","v":"Select"},"Select","Select","Select",{"$f":"IFERROR(IF(M377=\"No\",INDEX(IndexMatch!C:C,MATCH(1,(IndexMatch!A:A=VLOOKUP(H377,'Drop Down'!K:L,2,0))*(IndexMatch!B:B=L377),0)),\"Service Already Opened\"),\"N/A\")","v":"Service Already Opened"},0,{"$f":"IF(O377>VLOOKUP(L377,'Drop Down'!$A$3:$B$10,2,0),\"1\",\"0\")","v":"0"},0,{"$f":"SUM(Table1[[#This Row],[Case Aide Hours]],Table1[[#This Row],[Case Aide Travel Time]])","v":0},{"$f":"IFERROR(IF(OR(Table1[[#This Row],[Child Support Level]]=\"Support Services Lvl 1\", Table1[[#This Row],[Child Support Level]]=\"Support Services Lvl 2\",Table1[[#This Row],[Child Support Level]]=\"Select\"),\"Case Aid Not Allowed\", PRODUCT(Table1[[#This Row],[Total Case Aide]],VLOOKUP(Table1[[#This Row],[County Where Youth Resides]],'Drop Down'!K:M,3,0))),\"0\")","v":"Case Aid Not Allowed"},"No",0,0]
["Select","-","-","-","-","DD/MM/YYYY","DD/MM/YYYY","Select","Select",{"$f":"VLOOKUP(Table1[[#This Row],[DCYF Case Region]],'Drop Down'!$F$3:$G$9,2,0)","v":"Select"},"Select","Select","Select",{"$f":"IFERROR(IF(M378=\"No\",INDEX(IndexMatch!C:C,MATCH(1,(IndexMatch!A:A=VLOOKUP(H378,'Drop Down'!K:L,2,0))*(IndexMatch!B:B=L378),0)),\"Service Already Opened\"),\"N/A\")","v":"Service Already Opened"},0,{"$f":"IF(O378>VLOOKUP(L378,'Drop Down'!$A$3:$B$10,2,0),\"1\",\"0\")","v":"0"},0,{"$f":"SUM(Table1[[#This Row],[Case Aide Hours]],Table1[[#This Row],[Case Aide Travel Time]])","v":0},{"$f":"IFERROR(IF(OR(Table1[[#This Row],[Child Support Level]]=\"Support Services Lvl 1\", Table1[[#This Row],[Child Support Level]]=\"Support Services Lvl 2\",Table1[[#This Row],[Child Support Level]]=\"Select\"),\"Case Aid Not Allowed\", PRODUCT(Table1[[#This Row],[Total Case Aide]],VLOOKUP(Table1[[#This Row],[County Where Youth Resides]],'Drop Down'!K:M,3,0))),\"0\")","v":"Case Aid Not Allowed"},"No",0,0]
["Select","-","-","-","-","DD/MM/YYYY","DD/MM/YYYY","Select","Select",{"$f":"VLOOKUP(Table1[[#This Row],[DCYF Case Region]],'Drop Down'!$F$3:$G$9,2,0)","v":"Select"},"Select","Select","Select",{"$f":"IFERROR(IF(M379=\"No\",INDEX(IndexMatch!C:C,MATCH(1,(IndexMatch!A:A=VLOOKUP(H379,'Drop Down'!K:L,2,0))*(IndexMatch!B:B=L379),0)),\"Service Already Opened\"),\"N/A\")","v":"Service Already Opened"},0,{"$f":"IF(O379>VLOOKUP(L379,'Drop Down'!$A$3:$B$10,2,0),\"1\",\"0\")","v":"0"},0,{"$f":"SUM(Table1[[#This Row],[Case Aide Hours]],Table1[[#This Row],[Case Aide Travel Time]])","v":0},{"$f":"IFERROR(IF(OR(Table1[[#This Row],[Child Support Level]]=\"Support Services Lvl 1\", Table1[[#This Row],[Child Support Level]]=\"Support Services Lvl 2\",Table1[[#This Row],[Child Support Level]]=\"Select\"),\"Case Aid Not Allowed\", PRODUCT(Table1[[#This Row],[Total Case Aide]],VLOOKUP(Table1[[#This Row],[County Where Youth Resides]],'Drop Down'!K:M,3,0))),\"0\")","v":"Case Aid Not Allowed"},"No",0,0]
["Select","-","-","-","-","DD/MM/YYYY","DD/MM/YYYY","Select","Select",{"$f":"VLOOKUP(Table1[[#This Row],[DCYF Case Region]],'Drop Down'!$F$3:$G$9,2,0)","v":"Select"},"Select","Select","Select",{"$f":"IFERROR(IF(M380=\"No\",INDEX(IndexMatch!C:C,MATCH(1,(IndexMatch!A:A=VLOOKUP(H380,'Drop Down'!K:L,2,0))*(IndexMatch!B:B=L380),0)),\"Service Already Opened\"),\"N/A\")","v":"Service Already Opened"},0,{"$f":"IF(O380>VLOOKUP(L380,'Drop Down'!$A$3:$B$10,2,0),\"1\",\"0\")","v":"0"},0,{"$f":"SUM(Table1[[#This Row],[Case Aide Hours]],Table1[[#This Row],[Case Aide Travel Time]])","v":0},{"$f":"IFERROR(IF(OR(Table1[[#This Row],[Child Support Level]]=\"Support Services Lvl 1\", Table1[[#This Row],[Child Support Level]]=\"Support Services Lvl 2\",Table1[[#This Row],[Child Support Level]]=\"Select\"),\"Case Aid Not Allowed\", PRODUCT(Table1[[#This Row],[Total Case Aide]],VLOOKUP(Table1[[#This Row],[County Where Youth Resides]],'Drop Down'!K:M,3,0))),\"0\")","v":"Case Aid Not Allowed"},"No",0,0]
["Select","-","-","-","-","DD/MM/YYYY","DD/MM/YYYY","Select","Select",{"$f":"VLOOKUP(Table1[[#This Row],[DCYF Case Region]],'Drop Down'!$F$3:$G$9,2,0)","v":"Select"},"Select","Select","Select",{"$f":"IFERROR(IF(M381=\"No\",INDEX(IndexMatch!C:C,MATCH(1,(IndexMatch!A:A=VLOOKUP(H381,'Drop Down'!K:L,2,0))*(IndexMatch!B:B=L381),0)),\"Service Already Opened\"),\"N/A\")","v":"Service Already Opened"},0,{"$f":"IF(O381>VLOOKUP(L381,'Drop Down'!$A$3:$B$10,2,0),\"1\",\"0\")","v":"0"},0,{"$f":"SUM(Table1[[#This Row],[Case Aide Hours]],Table1[[#This Row],[Case Aide Travel Time]])","v":0},{"$f":"IFERROR(IF(OR(Table1[[#This Row],[Child Support Level]]=\"Support Services Lvl 1\", Table1[[#This Row],[Child Support Level]]=\"Support Services Lvl 2\",Table1[[#This Row],[Child Support Level]]=\"Select\"),\"Case Aid Not Allowed\", PRODUCT(Table1[[#This Row],[Total Case Aide]],VLOOKUP(Table1[[#This Row],[County Where Youth Resides]],'Drop Down'!K:M,3,0))),\"0\")","v":"Case Aid Not Allowed"},"No",0,0]
["Select","-","-","-","-","DD/MM/YYYY","DD/MM/YYYY","Select","Select",{"$f":"VLOOKUP(Table1[[#This Row],[DCYF Case Region]],'Drop Down'!$F$3:$G$9,2,0)","v":"Select"},"Select","Select","Select",{"$f":"IFERROR(IF(M382=\"No\",INDEX(IndexMatch!C:C,MATCH(1,(IndexMatch!A:A=VLOOKUP(H382,'Drop Down'!K:L,2,0))*(IndexMatch!B:B=L382),0)),\"Service Already Opened\"),\"N/A\")","v":"Service Already Opened"},0,{"$f":"IF(O382>VLOOKUP(L382,'Drop Down'!$A$3:$B$10,2,0),\"1\",\"0\")","v":"0"},0,{"$f":"SUM(Table1[[#This Row],[Case Aide Hours]],Table1[[#This Row],[Case Aide Travel Time]])","v":0},{"$f":"IFERROR(IF(OR(Table1[[#This Row],[Child Support Level]]=\"Support Services Lvl 1\", Table1[[#This Row],[Child Support Level]]=\"Support Services Lvl 2\",Table1[[#This Row],[Child Support Level]]=\"Select\"),\"Case Aid Not Allowed\", PRODUCT(Table1[[#This Row],[Total Case Aide]],VLOOKUP(Table1[[#This Row],[County Where Youth Resides]],'Drop Down'!K:M,3,0))),\"0\")","v":"Case Aid Not Allowed"},"No",0,0]
["Select","-","-","-","-","DD/MM/YYYY","DD/MM/YYYY","Select","Select",{"$f":"VLOOKUP(Table1[[#This Row],[DCYF Case Region]],'Drop Down'!$F$3:$G$9,2,0)","v":"Select"},"Select","Select","Select",{"$f":"IFERROR(IF(M383=\"No\",INDEX(IndexMatch!C:C,MATCH(1,(IndexMatch!A:A=VLOOKUP(H383,'Drop Down'!K:L,2,0))*(IndexMatch!B:B=L383),0)),\"Service Already Opened\"),\"N/A\")","v":"Service Already Opened"},0,{"$f":"IF(O383>VLOOKUP(L383,'Drop Down'!$A$3:$B$10,2,0),\"1\",\"0\")","v":"0"},0,{"$f":"SUM(Table1[[#This Row],[Case Aide Hours]],Table1[[#This Row],[Case Aide Travel Time]])","v":0},{"$f":"IFERROR(IF(OR(Table1[[#This Row],[Child Support Level]]=\"Support Services Lvl 1\", Table1[[#This Row],[Child Support Level]]=\"Support Services Lvl 2\",Table1[[#This Row],[Child Support Level]]=\"Select\"),\"Case Aid Not Allowed\", PRODUCT(Table1[[#This Row],[Total Case Aide]],VLOOKUP(Table1[[#This Row],[County Where Youth Resides]],'Drop Down'!K:M,3,0))),\"0\")","v":"Case Aid Not Allowed"},"No",0,0]
["Select","-","-","-","-","DD/MM/YYYY","DD/MM/YYYY","Select","Select",{"$f":"VLOOKUP(Table1[[#This Row],[DCYF Case Region]],'Drop Down'!$F$3:$G$9,2,0)","v":"Select"},"Select","Select","Select",{"$f":"IFERROR(IF(M384=\"No\",INDEX(IndexMatch!C:C,MATCH(1,(IndexMatch!A:A=VLOOKUP(H384,'Drop Down'!K:L,2,0))*(IndexMatch!B:B=L384),0)),\"Service Already Opened\"),\"N/A\")","v":"Service Already Opened"},0,{"$f":"IF(O384>VLOOKUP(L384,'Drop Down'!$A$3:$B$10,2,0),\"1\",\"0\")","v":"0"},0,{"$f":"SUM(Table1[[#This Row],[Case Aide Hours]],Table1[[#This Row],[Case Aide Travel Time]])","v":0},{"$f":"IFERROR(IF(OR(Table1[[#This Row],[Child Support Level]]=\"Support Services Lvl 1\", Table1[[#This Row],[Child Support Level]]=\"Support Services Lvl 2\",Table1[[#This Row],[Child Support Level]]=\"Select\"),\"Case Aid Not Allowed\", PRODUCT(Table1[[#This Row],[Total Case Aide]],VLOOKUP(Table1[[#This Row],[County Where Youth Resides]],'Drop Down'!K:M,3,0))),\"0\")","v":"Case Aid Not Allowed"},"No",0,0]
["Select","-","-","-","-","DD/MM/YYYY","DD/MM/YYYY","Select","Select",{"$f":"VLOOKUP(Table1[[#This Row],[DCYF Case Region]],'Drop Down'!$F$3:$G$9,2,0)","v":"Select"},"Select","Select","Select",{"$f":"IFERROR(IF(M385=\"No\",INDEX(IndexMatch!C:C,MATCH(1,(IndexMatch!A:A=VLOOKUP(H385,'Drop Down'!K:L,2,0))*(IndexMatch!B:B=L385),0)),\"Service Already Opened\"),\"N/A\")","v":"Service Already Opened"},0,{"$f":"IF(O385>VLOOKUP(L385,'Drop Down'!$A$3:$B$10,2,0),\"1\",\"0\")","v":"0"},0,{"$f":"SUM(Table1[[#This Row],[Case Aide Hours]],Table1[[#This Row],[Case Aide Travel Time]])","v":0},{"$f":"IFERROR(IF(OR(Table1[[#This Row],[Child Support Level]]=\"Support Services Lvl 1\", Table1[[#This Row],[Child Support Level]]=\"Support Services Lvl 2\",Table1[[#This Row],[Child Support Level]]=\"Select\"),\"Case Aid Not Allowed\", PRODUCT(Table1[[#This Row],[Total Case Aide]],VLOOKUP(Table1[[#This Row],[County Where Youth Resides]],'Drop Down'!K:M,3,0))),\"0\")","v":"Case Aid Not Allowed"},"No",0,0]
["Select","-","-","-","-","DD/MM/YYYY","DD/MM/YYYY","Select","Select",{"$f":"VLOOKUP(Table1[[#This Row],[DCYF Case Region]],'Drop Down'!$F$3:$G$9,2,0)","v":"Select"},"Select","Select","Select",{"$f":"IFERROR(IF(M386=\"No\",INDEX(IndexMatch!C:C,MATCH(1,(IndexMatch!A:A=VLOOKUP(H386,'Drop Down'!K:L,2,0))*(IndexMatch!B:B=L386),0)),\"Service Already Opened\"),\"N/A\")","v":"Service Already Opened"},0,{"$f":"IF(O386>VLOOKUP(L386,'Drop Down'!$A$3:$B$10,2,0),\"1\",\"0\")","v":"0"},0,{"$f":"SUM(Table1[[#This Row],[Case Aide Hours]],Table1[[#This Row],[Case Aide Travel Time]])","v":0},{"$f":"IFERROR(IF(OR(Table1[[#This Row],[Child Support Level]]=\"Support Services Lvl 1\", Table1[[#This Row],[Child Support Level]]=\"Support Services Lvl 2\",Table1[[#This Row],[Child Support Level]]=\"Select\"),\"Case Aid Not Allowed\", PRODUCT(Table1[[#This Row],[Total Case Aide]],VLOOKUP(Table1[[#This Row],[County Where Youth Resides]],'Drop Down'!K:M,3,0))),\"0\")","v":"Case Aid Not Allowed"},"No",0,{"$f":"ROUND(PRODUCT(U386,0.67),2)","v":0}]
["Select","-","-","-","-","DD/MM/YYYY","DD/MM/YYYY","Select","Select",{"$f":"VLOOKUP(Table1[[#This Row],[DCYF Case Region]],'Drop Down'!$F$3:$G$9,2,0)","v":"Select"},"Select","Select","Select",{"$f":"IFERROR(IF(M387=\"No\",INDEX(IndexMatch!C:C,MATCH(1,(IndexMatch!A:A=VLOOKUP(H387,'Drop Down'!K:L,2,0))*(IndexMatch!B:B=L387),0)),\"Service Already Opened\"),\"N/A\")","v":"Service Already Opened"},0,{"$f":"IF(O387>VLOOKUP(L387,'Drop Down'!$A$3:$B$10,2,0),\"1\",\"0\")","v":"0"},0,{"$f":"SUM(Table1[[#This Row],[Case Aide Hours]],Table1[[#This Row],[Case Aide Travel Time]])","v":0},{"$f":"IFERROR(IF(OR(Table1[[#This Row],[Child Support Level]]=\"Support Services Lvl 1\", Table1[[#This Row],[Child Support Level]]=\"Support Services Lvl 2\",Table1[[#This Row],[Child Support Level]]=\"Select\"),\"Case Aid Not Allowed\", PRODUCT(Table1[[#This Row],[Total Case Aide]],VLOOKUP(Table1[[#This Row],[County Where Youth Resides]],'Drop Down'!K:M,3,0))),\"0\")","v":"Case Aid Not Allowed"},{"$f":"IF(P387=\"1\",\"Yes\",\"No\")","v":"No"},0,0]
["Select","-","-","-","-","DD/MM/YYYY","DD/MM/YYYY","Select","Select",{"$f":"VLOOKUP(Table1[[#This Row],[DCYF Case Region]],'Drop Down'!$F$3:$G$9,2,0)","v":"Select"},"Select","Select","Select",{"$f":"IFERROR(IF(M388=\"No\",INDEX(IndexMatch!C:C,MATCH(1,(IndexMatch!A:A=VLOOKUP(H388,'Drop Down'!K:L,2,0))*(IndexMatch!B:B=L388),0)),\"Service Already Opened\"),\"N/A\")","v":"Service Already Opened"},0,{"$f":"IF(O388>VLOOKUP(L388,'Drop Down'!$A$3:$B$10,2,0),\"1\",\"0\")","v":"0"},0,{"$f":"SUM(Table1[[#This Row],[Case Aide Hours]],Table1[[#This Row],[Case Aide Travel Time]])","v":0},{"$f":"IFERROR(IF(OR(Table1[[#This Row],[Child Support Level]]=\"Support Services Lvl 1\", Table1[[#This Row],[Child Support Level]]=\"Support Services Lvl 2\",Table1[[#This Row],[Child Support Level]]=\"Select\"),\"Case Aid Not Allowed\", PRODUCT(Table1[[#This Row],[Total Case Aide]],VLOOKUP(Table1[[#This Row],[County Where Youth Resides]],'Drop Down'!K:M,3,0))),\"0\")","v":"Case Aid Not Allowed"},"No",0,0]
["Select","-","-","-","-","DD/MM/YYYY","DD/MM/YYYY","Select","Select",{"$f":"VLOOKUP(Table1[[#This Row],[DCYF Case Region]],'Drop Down'!$F$3:$G$9,2,0)","v":"Select"},"Select","Select","Select",{"$f":"IFERROR(IF(M389=\"No\",INDEX(IndexMatch!C:C,MATCH(1,(IndexMatch!A:A=VLOOKUP(H389,'Drop Down'!K:L,2,0))*(IndexMatch!B:B=L389),0)),\"Service Already Opened\"),\"N/A\")","v":"Service Already Opened"},0,{"$f":"IF(O389>VLOOKUP(L389,'Drop Down'!$A$3:$B$10,2,0),\"1\",\"0\")","v":"0"},0,{"$f":"SUM(Table1[[#This Row],[Case Aide Hours]],Table1[[#This Row],[Case Aide Travel Time]])","v":0},{"$f":"IFERROR(IF(OR(Table1[[#This Row],[Child Support Level]]=\"Support Services Lvl 1\", Table1[[#This Row],[Child Support Level]]=\"Support Services Lvl 2\",Table1[[#This Row],[Child Support Level]]=\"Select\"),\"Case Aid Not Allowed\", PRODUCT(Table1[[#This Row],[Total Case Aide]],VLOOKUP(Table1[[#This Row],[County Where Youth Resides]],'Drop Down'!K:M,3,0))),\"0\")","v":"Case Aid Not Allowed"},"No",0,0]
["Select","-","-","-","-","DD/MM/YYYY","DD/MM/YYYY","Select","Select",{"$f":"VLOOKUP(Table1[[#This Row],[DCYF Case Region]],'Drop Down'!$F$3:$G$9,2,0)","v":"Select"},"Select","Select","Select",{"$f":"IFERROR(IF(M390=\"No\",INDEX(IndexMatch!C:C,MATCH(1,(IndexMatch!A:A=VLOOKUP(H390,'Drop Down'!K:L,2,0))*(IndexMatch!B:B=L390),0)),\"Service Already Opened\"),\"N/A\")","v":"Service Already Opened"},0,{"$f":"IF(O390>VLOOKUP(L390,'Drop Down'!$A$3:$B$10,2,0),\"1\",\"0\")","v":"0"},0,{"$f":"SUM(Table1[[#This Row],[Case Aide Hours]],Table1[[#This Row],[Case Aide Travel Time]])","v":0},{"$f":"IFERROR(IF(OR(Table1[[#This Row],[Child Support Level]]=\"Support Services Lvl 1\", Table1[[#This Row],[Child Support Level]]=\"Support Services Lvl 2\",Table1[[#This Row],[Child Support Level]]=\"Select\"),\"Case Aid Not Allowed\", PRODUCT(Table1[[#This Row],[Total Case Aide]],VLOOKUP(Table1[[#This Row],[County Where Youth Resides]],'Drop Down'!K:M,3,0))),\"0\")","v":"Case Aid Not Allowed"},"No",0,0]
["Select","-","-","-","-","DD/MM/YYYY","DD/MM/YYYY","Select","Select",{"$f":"VLOOKUP(Table1[[#This Row],[DCYF Case Region]],'Drop Down'!$F$3:$G$9,2,0)","v":"Select"},"Select","Select","Select",{"$f":"IFERROR(IF(M391=\"No\",INDEX(IndexMatch!C:C,MATCH(1,(IndexMatch!A:A=VLOOKUP(H391,'Drop Down'!K:L,2,0))*(IndexMatch!B:B=L391),0)),\"Service Already Opened\"),\"N/A\")","v":"Service Already Opened"},0,{"$f":"IF(O391>VLOOKUP(L391,'Drop Down'!$A$3:$B$10,2,0),\"1\",\"0\")","v":"0"},0,{"$f":"SUM(Table1[[#This Row],[Case Aide Hours]],Table1[[#This Row],[Case Aide Travel Time]])","v":0},{"$f":"IFERROR(IF(OR(Table1[[#This Row],[Child Support Level]]=\"Support Services Lvl 1\", Table1[[#This Row],[Child Support Level]]=\"Support Services Lvl 2\",Table1[[#This Row],[Child Support Level]]=\"Select\"),\"Case Aid Not Allowed\", PRODUCT(Table1[[#This Row],[Total Case Aide]],VLOOKUP(Table1[[#This Row],[County Where Youth Resides]],'Drop Down'!K:M,3,0))),\"0\")","v":"Case Aid Not Allowed"},"No",0,0]
["Select","-","-","-","-","DD/MM/YYYY","DD/MM/YYYY","Select","Select",{"$f":"VLOOKUP(Table1[[#This Row],[DCYF Case Region]],'Drop Down'!$F$3:$G$9,2,0)","v":"Select"},"Select","Select","Select",{"$f":"IFERROR(IF(M392=\"No\",INDEX(IndexMatch!C:C,MATCH(1,(IndexMatch!A:A=VLOOKUP(H392,'Drop Down'!K:L,2,0))*(IndexMatch!B:B=L392),0)),\"Service Already Opened\"),\"N/A\")","v":"Service Already Opened"},0,{"$f":"IF(O392>VLOOKUP(L392,'Drop Down'!$A$3:$B$10,2,0),\"1\",\"0\")","v":"0"},0,{"$f":"SUM(Table1[[#This Row],[Case Aide Hours]],Table1[[#This Row],[Case Aide Travel Time]])","v":0},{"$f":"IFERROR(IF(OR(Table1[[#This Row],[Child Support Level]]=\"Support Services Lvl 1\", Table1[[#This Row],[Child Support Level]]=\"Support Services Lvl 2\",Table1[[#This Row],[Child Support Level]]=\"Select\"),\"Case Aid Not Allowed\", PRODUCT(Table1[[#This Row],[Total Case Aide]],VLOOKUP(Table1[[#This Row],[County Where Youth Resides]],'Drop Down'!K:M,3,0))),\"0\")","v":"Case Aid Not Allowed"},"No",0,0]
["Select","-","-","-","-","DD/MM/YYYY","DD/MM/YYYY","Select","Select",{"$f":"VLOOKUP(Table1[[#This Row],[DCYF Case Region]],'Drop Down'!$F$3:$G$9,2,0)","v":"Select"},"Select","Select","Select",{"$f":"IFERROR(IF(M393=\"No\",INDEX(IndexMatch!C:C,MATCH(1,(IndexMatch!A:A=VLOOKUP(H393,'Drop Down'!K:L,2,0))*(IndexMatch!B:B=L393),0)),\"Service Already Opened\"),\"N/A\")","v":"Service Already Opened"},0,{"$f":"IF(O393>VLOOKUP(L393,'Drop Down'!$A$3:$B$10,2,0),\"1\",\"0\")","v":"0"},0,{"$f":"SUM(Table1[[#This Row],[Case Aide Hours]],Table1[[#This Row],[Case Aide Travel Time]])","v":0},{"$f":"IFERROR(IF(OR(Table1[[#This Row],[Child Support Level]]=\"Support Services Lvl 1\", Table1[[#This Row],[Child Support Level]]=\"Support Services Lvl 2\",Table1[[#This Row],[Child Support Level]]=\"Select\"),\"Case Aid Not Allowed\", PRODUCT(Table1[[#This Row],[Total Case Aide]],VLOOKUP(Table1[[#This Row],[County Where Youth Resides]],'Drop Down'!K:M,3,0))),\"0\")","v":"Case Aid Not Allowed"},"No",0,0]
["Select","-","-","-","-","DD/MM/YYYY","DD/MM/YYYY","Select","Select",{"$f":"VLOOKUP(Table1[[#This Row],[DCYF Case Region]],'Drop Down'!$F$3:$G$9,2,0)","v":"Select"},"Select","Select","Select",{"$f":"IFERROR(IF(M394=\"No\",INDEX(IndexMatch!C:C,MATCH(1,(IndexMatch!A:A=VLOOKUP(H394,'Drop Down'!K:L,2,0))*(IndexMatch!B:B=L394),0)),\"Service Already Opened\"),\"N/A\")","v":"Service Already Opened"},0,{"$f":"IF(O394>VLOOKUP(L394,'Drop Down'!$A$3:$B$10,2,0),\"1\",\"0\")","v":"0"},0,{"$f":"SUM(Table1[[#This Row],[Case Aide Hours]],Table1[[#This Row],[Case Aide Travel Time]])","v":0},{"$f":"IFERROR(IF(OR(Table1[[#This Row],[Child Support Level]]=\"Support Services Lvl 1\", Table1[[#This Row],[Child Support Level]]=\"Support Services Lvl 2\",Table1[[#This Row],[Child Support Level]]=\"Select\"),\"Case Aid Not Allowed\", PRODUCT(Table1[[#This Row],[Total Case Aide]],VLOOKUP(Table1[[#This Row],[County Where Youth Resides]],'Drop Down'!K:M,3,0))),\"0\")","v":"Case Aid Not Allowed"},"No",0,0]
["Select","-","-","-","-","DD/MM/YYYY","DD/MM/YYYY","Select","Select",{"$f":"VLOOKUP(Table1[[#This Row],[DCYF Case Region]],'Drop Down'!$F$3:$G$9,2,0)","v":"Select"},"Select","Select","Select",{"$f":"IFERROR(IF(M395=\"No\",INDEX(IndexMatch!C:C,MATCH(1,(IndexMatch!A:A=VLOOKUP(H395,'Drop Down'!K:L,2,0))*(IndexMatch!B:B=L395),0)),\"Service Already Opened\"),\"N/A\")","v":"Service Already Opened"},0,{"$f":"IF(O395>VLOOKUP(L395,'Drop Down'!$A$3:$B$10,2,0),\"1\",\"0\")","v":"0"},0,{"$f":"SUM(Table1[[#This Row],[Case Aide Hours]],Table1[[#This Row],[Case Aide Travel Time]])","v":0},{"$f":"IFERROR(IF(OR(Table1[[#This Row],[Child Support Level]]=\"Support Services Lvl 1\", Table1[[#This Row],[Child Support Level]]=\"Support Services Lvl 2\",Table1[[#This Row],[Child Support Level]]=\"Select\"),\"Case Aid Not Allowed\", PRODUCT(Table1[[#This Row],[Total Case Aide]],VLOOKUP(Table1[[#This Row],[County Where Youth Resides]],'Drop Down'!K:M,3,0))),\"0\")","v":"Case Aid Not Allowed"},"No",0,0]
["Select","-","-","-","-","DD/MM/YYYY","DD/MM/YYYY","Select","Select",{"$f":"VLOOKUP(Table1[[#This Row],[DCYF Case Region]],'Drop Down'!$F$3:$G$9,2,0)","v":"Select"},"Select","Select","Select",{"$f":"IFERROR(IF(M396=\"No\",INDEX(IndexMatch!C:C,MATCH(1,(IndexMatch!A:A=VLOOKUP(H396,'Drop Down'!K:L,2,0))*(IndexMatch!B:B=L396),0)),\"Service Already Opened\"),\"N/A\")","v":"Service Already Opened"},0,{"$f":"IF(O396>VLOOKUP(L396,'Drop Down'!$A$3:$B$10,2,0),\"1\",\"0\")","v":"0"},0,{"$f":"SUM(Table1[[#This Row],[Case Aide Hours]],Table1[[#This Row],[Case Aide Travel Time]])","v":0},{"$f":"IFERROR(IF(OR(Table1[[#This Row],[Child Support Level]]=\"Support Services Lvl 1\", Table1[[#This Row],[Child Support Level]]=\"Support Services Lvl 2\",Table1[[#This Row],[Child Support Level]]=\"Select\"),\"Case Aid Not Allowed\", PRODUCT(Table1[[#This Row],[Total Case Aide]],VLOOKUP(Table1[[#This Row],[County Where Youth Resides]],'Drop Down'!K:M,3,0))),\"0\")","v":"Case Aid Not Allowed"},"No",0,0]
["Select","-","-","-","-","DD/MM/YYYY","DD/MM/YYYY","Select","Select",{"$f":"VLOOKUP(Table1[[#This Row],[DCYF Case Region]],'Drop Down'!$F$3:$G$9,2,0)","v":"Select"},"Select","Select","Select",{"$f":"IFERROR(IF(M397=\"No\",INDEX(IndexMatch!C:C,MATCH(1,(IndexMatch!A:A=VLOOKUP(H397,'Drop Down'!K:L,2,0))*(IndexMatch!B:B=L397),0)),\"Service Already Opened\"),\"N/A\")","v":"Service Already Opened"},0,{"$f":"IF(O397>VLOOKUP(L397,'Drop Down'!$A$3:$B$10,2,0),\"1\",\"0\")","v":"0"},0,{"$f":"SUM(Table1[[#This Row],[Case Aide Hours]],Table1[[#This Row],[Case Aide Travel Time]])","v":0},{"$f":"IFERROR(IF(OR(Table1[[#This Row],[Child Support Level]]=\"Support Services Lvl 1\", Table1[[#This Row],[Child Support Level]]=\"Support Services Lvl 2\",Table1[[#This Row],[Child Support Level]]=\"Select\"),\"Case Aid Not Allowed\", PRODUCT(Table1[[#This Row],[Total Case Aide]],VLOOKUP(Table1[[#This Row],[County Where Youth Resides]],'Drop Down'!K:M,3,0))),\"0\")","v":"Case Aid Not Allowed"},"No",0,0]
["Select","-","-","-","-","DD/MM/YYYY","DD/MM/YYYY","Select","Select",{"$f":"VLOOKUP(Table1[[#This Row],[DCYF Case Region]],'Drop Down'!$F$3:$G$9,2,0)","v":"Select"},"Select","Select","Select",{"$f":"IFERROR(IF(M398=\"No\",INDEX(IndexMatch!C:C,MATCH(1,(IndexMatch!A:A=VLOOKUP(H398,'Drop Down'!K:L,2,0))*(IndexMatch!B:B=L398),0)),\"Service Already Opened\"),\"N/A\")","v":"Service Already Opened"},0,{"$f":"IF(O398>VLOOKUP(L398,'Drop Down'!$A$3:$B$10,2,0),\"1\",\"0\")","v":"0"},0,{"$f":"SUM(Table1[[#This Row],[Case Aide Hours]],Table1[[#This Row],[Case Aide Travel Time]])","v":0},{"$f":"IFERROR(IF(OR(Table1[[#This Row],[Child Support Level]]=\"Support Services Lvl 1\", Table1[[#This Row],[Child Support Level]]=\"Support Services Lvl 2\",Table1[[#This Row],[Child Support Level]]=\"Select\"),\"Case Aid Not Allowed\", PRODUCT(Table1[[#This Row],[Total Case Aide]],VLOOKUP(Table1[[#This Row],[County Where Youth Resides]],'Drop Down'!K:M,3,0))),\"0\")","v":"Case Aid Not Allowed"},"No",0,0]
["Select","-","-","-","-","DD/MM/YYYY","DD/MM/YYYY","Select","Select",{"$f":"VLOOKUP(Table1[[#This Row],[DCYF Case Region]],'Drop Down'!$F$3:$G$9,2,0)","v":"Select"},"Select","Select","Select",{"$f":"IFERROR(IF(M399=\"No\",INDEX(IndexMatch!C:C,MATCH(1,(IndexMatch!A:A=VLOOKUP(H399,'Drop Down'!K:L,2,0))*(IndexMatch!B:B=L399),0)),\"Service Already Opened\"),\"N/A\")","v":"Service Already Opened"},0,{"$f":"IF(O399>VLOOKUP(L399,'Drop Down'!$A$3:$B$10,2,0),\"1\",\"0\")","v":"0"},0,{"$f":"SUM(Table1[[#This Row],[Case Aide Hours]],Table1[[#This Row],[Case Aide Travel Time]])","v":0},{"$f":"IFERROR(IF(OR(Table1[[#This Row],[Child Support Level]]=\"Support Services Lvl 1\", Table1[[#This Row],[Child Support Level]]=\"Support Services Lvl 2\",Table1[[#This Row],[Child Support Level]]=\"Select\"),\"Case Aid Not Allowed\", PRODUCT(Table1[[#This Row],[Total Case Aide]],VLOOKUP(Table1[[#This Row],[County Where Youth Resides]],'Drop Down'!K:M,3,0))),\"0\")","v":"Case Aid Not Allowed"},"No",0,0]
["Select","-","-","-","-","DD/MM/YYYY","DD/MM/YYYY","Select","Select",{"$f":"VLOOKUP(Table1[[#This Row],[DCYF Case Region]],'Drop Down'!$F$3:$G$9,2,0)","v":"Select"},"Select","Select","Select",{"$f":"IFERROR(IF(M400=\"No\",INDEX(IndexMatch!C:C,MATCH(1,(IndexMatch!A:A=VLOOKUP(H400,'Drop Down'!K:L,2,0))*(IndexMatch!B:B=L400),0)),\"Service Already Opened\"),\"N/A\")","v":"Service Already Opened"},0,{"$f":"IF(O400>VLOOKUP(L400,'Drop Down'!$A$3:$B$10,2,0),\"1\",\"0\")","v":"0"},0,{"$f":"SUM(Table1[[#This Row],[Case Aide Hours]],Table1[[#This Row],[Case Aide Travel Time]])","v":0},{"$f":"IFERROR(IF(OR(Table1[[#This Row],[Child Support Level]]=\"Support Services Lvl 1\", Table1[[#This Row],[Child Support Level]]=\"Support Services Lvl 2\",Table1[[#This Row],[Child Support Level]]=\"Select\"),\"Case Aid Not Allowed\", PRODUCT(Table1[[#This Row],[Total Case Aide]],VLOOKUP(Table1[[#This Row],[County Where Youth Resides]],'Drop Down'!K:M,3,0))),\"0\")","v":"Case Aid Not Allowed"},"No",0,0]
["Select","-","-","-","-","DD/MM/YYYY","DD/MM/YYYY","Select","Select",{"$f":"VLOOKUP(Table1[[#This Row],[DCYF Case Region]],'Drop Down'!$F$3:$G$9,2,0)","v":"Select"},"Select","Select","Select",{"$f":"IFERROR(IF(M401=\"No\",INDEX(IndexMatch!C:C,MATCH(1,(IndexMatch!A:A=VLOOKUP(H401,'Drop Down'!K:L,2,0))*(IndexMatch!B:B=L401),0)),\"Service Already Opened\"),\"N/A\")","v":"Service Already Opened"},0,{"$f":"IF(O401>VLOOKUP(L401,'Drop Down'!$A$3:$B$10,2,0),\"1\",\"0\")","v":"0"},0,{"$f":"SUM(Table1[[#This Row],[Case Aide Hours]],Table1[[#This Row],[Case Aide Travel Time]])","v":0},{"$f":"IFERROR(IF(OR(Table1[[#This Row],[Child Support Level]]=\"Support Services Lvl 1\", Table1[[#This Row],[Child Support Level]]=\"Support Services Lvl 2\",Table1[[#This Row],[Child Support Level]]=\"Select\"),\"Case Aid Not Allowed\", PRODUCT(Table1[[#This Row],[Total Case Aide]],VLOOKUP(Table1[[#This Row],[County Where Youth Resides]],'Drop Down'!K:M,3,0))),\"0\")","v":"Case Aid Not Allowed"},"No",0,0]
["Select","-","-","-","-","DD/MM/YYYY","DD/MM/YYYY","Select","Select",{"$f":"VLOOKUP(Table1[[#This Row],[DCYF Case Region]],'Drop Down'!$F$3:$G$9,2,0)","v":"Select"},"Select","Select","Select",{"$f":"IFERROR(IF(M402=\"No\",INDEX(IndexMatch!C:C,MATCH(1,(IndexMatch!A:A=VLOOKUP(H402,'Drop Down'!K:L,2,0))*(IndexMatch!B:B=L402),0)),\"Service Already Opened\"),\"N/A\")","v":"Service Already Opened"},0,{"$f":"IF(O402>VLOOKUP(L402,'Drop Down'!$A$3:$B$10,2,0),\"1\",\"0\")","v":"0"},0,{"$f":"SUM(Table1[[#This Row],[Case Aide Hours]],Table1[[#This Row],[Case Aide Travel Time]])","v":0},{"$f":"IFERROR(IF(OR(Table1[[#This Row],[Child Support Level]]=\"Support Services Lvl 1\", Table1[[#This Row],[Child Support Level]]=\"Support Services Lvl 2\",Table1[[#This Row],[Child Support Level]]=\"Select\"),\"Case Aid Not Allowed\", PRODUCT(Table1[[#This Row],[Total Case Aide]],VLOOKUP(Table1[[#This Row],[County Where Youth Resides]],'Drop Down'!K:M,3,0))),\"0\")","v":"Case Aid Not Allowed"},"No",0,0]
["Select","-","-","-","-","DD/MM/YYYY","DD/MM/YYYY","Select","Select",{"$f":"VLOOKUP(Table1[[#This Row],[DCYF Case Region]],'Drop Down'!$F$3:$G$9,2,0)","v":"Select"},"Select","Select","Select",{"$f":"IFERROR(IF(M403=\"No\",INDEX(IndexMatch!C:C,MATCH(1,(IndexMatch!A:A=VLOOKUP(H403,'Drop Down'!K:L,2,0))*(IndexMatch!B:B=L403),0)),\"Service Already Opened\"),\"N/A\")","v":"Service Already Opened"},0,{"$f":"IF(O403>VLOOKUP(L403,'Drop Down'!$A$3:$B$10,2,0),\"1\",\"0\")","v":"0"},0,{"$f":"SUM(Table1[[#This Row],[Case Aide Hours]],Table1[[#This Row],[Case Aide Travel Time]])","v":0},{"$f":"IFERROR(IF(OR(Table1[[#This Row],[Child Support Level]]=\"Support Services Lvl 1\", Table1[[#This Row],[Child Support Level]]=\"Support Services Lvl 2\",Table1[[#This Row],[Child Support Level]]=\"Select\"),\"Case Aid Not Allowed\", PRODUCT(Table1[[#This Row],[Total Case Aide]],VLOOKUP(Table1[[#This Row],[County Where Youth Resides]],'Drop Down'!K:M,3,0))),\"0\")","v":"Case Aid Not Allowed"},"No",0,0]
["Select","-","-","-","-","DD/MM/YYYY","DD/MM/YYYY","Select","Select",{"$f":"VLOOKUP(Table1[[#This Row],[DCYF Case Region]],'Drop Down'!$F$3:$G$9,2,0)","v":"Select"},"Select","Select","Select",{"$f":"IFERROR(IF(M404=\"No\",INDEX(IndexMatch!C:C,MATCH(1,(IndexMatch!A:A=VLOOKUP(H404,'Drop Down'!K:L,2,0))*(IndexMatch!B:B=L404),0)),\"Service Already Opened\"),\"N/A\")","v":"Service Already Opened"},0,{"$f":"IF(O404>VLOOKUP(L404,'Drop Down'!$A$3:$B$10,2,0),\"1\",\"0\")","v":"0"},0,{"$f":"SUM(Table1[[#This Row],[Case Aide Hours]],Table1[[#This Row],[Case Aide Travel Time]])","v":0},{"$f":"IFERROR(IF(OR(Table1[[#This Row],[Child Support Level]]=\"Support Services Lvl 1\", Table1[[#This Row],[Child Support Level]]=\"Support Services Lvl 2\",Table1[[#This Row],[Child Support Level]]=\"Select\"),\"Case Aid Not Allowed\", PRODUCT(Table1[[#This Row],[Total Case Aide]],VLOOKUP(Table1[[#This Row],[County Where Youth Resides]],'Drop Down'!K:M,3,0))),\"0\")","v":"Case Aid Not Allowed"},"No",0,0]
["Select","-","-","-","-","DD/MM/YYYY","DD/MM/YYYY","Select","Select",{"$f":"VLOOKUP(Table1[[#This Row],[DCYF Case Region]],'Drop Down'!$F$3:$G$9,2,0)","v":"Select"},"Select","Select","Select",{"$f":"IFERROR(IF(M405=\"No\",INDEX(IndexMatch!C:C,MATCH(1,(IndexMatch!A:A=VLOOKUP(H405,'Drop Down'!K:L,2,0))*(IndexMatch!B:B=L405),0)),\"Service Already Opened\"),\"N/A\")","v":"Service Already Opened"},0,{"$f":"IF(O405>VLOOKUP(L405,'Drop Down'!$A$3:$B$10,2,0),\"1\",\"0\")","v":"0"},0,{"$f":"SUM(Table1[[#This Row],[Case Aide Hours]],Table1[[#This Row],[Case Aide Travel Time]])","v":0},{"$f":"IFERROR(IF(OR(Table1[[#This Row],[Child Support Level]]=\"Support Services Lvl 1\", Table1[[#This Row],[Child Support Level]]=\"Support Services Lvl 2\",Table1[[#This Row],[Child Support Level]]=\"Select\"),\"Case Aid Not Allowed\", PRODUCT(Table1[[#This Row],[Total Case Aide]],VLOOKUP(Table1[[#This Row],[County Where Youth Resides]],'Drop Down'!K:M,3,0))),\"0\")","v":"Case Aid Not Allowed"},"No",0,0]
["Select","-","-","-","-","DD/MM/YYYY","DD/MM/YYYY","Select","Select",{"$f":"VLOOKUP(Table1[[#This Row],[DCYF Case Region]],'Drop Down'!$F$3:$G$9,2,0)","v":"Select"},"Select","Select","Select",{"$f":"IFERROR(IF(M406=\"No\",INDEX(IndexMatch!C:C,MATCH(1,(IndexMatch!A:A=VLOOKUP(H406,'Drop Down'!K:L,2,0))*(IndexMatch!B:B=L406),0)),\"Service Already Opened\"),\"N/A\")","v":"Service Already Opened"},0,{"$f":"IF(O406>VLOOKUP(L406,'Drop Down'!$A$3:$B$10,2,0),\"1\",\"0\")","v":"0"},0,{"$f":"SUM(Table1[[#This Row],[Case Aide Hours]],Table1[[#This Row],[Case Aide Travel Time]])","v":0},{"$f":"IFERROR(IF(OR(Table1[[#This Row],[Child Support Level]]=\"Support Services Lvl 1\", Table1[[#This Row],[Child Support Level]]=\"Support Services Lvl 2\",Table1[[#This Row],[Child Support Level]]=\"Select\"),\"Case Aid Not Allowed\", PRODUCT(Table1[[#This Row],[Total Case Aide]],VLOOKUP(Table1[[#This Row],[County Where Youth Resides]],'Drop Down'!K:M,3,0))),\"0\")","v":"Case Aid Not Allowed"},"No",0,0]
["Select","-","-","-","-","DD/MM/YYYY","DD/MM/YYYY","Select","Select",{"$f":"VLOOKUP(Table1[[#This Row],[DCYF Case Region]],'Drop Down'!$F$3:$G$9,2,0)","v":"Select"},"Select","Select","Select",{"$f":"IFERROR(IF(M407=\"No\",INDEX(IndexMatch!C:C,MATCH(1,(IndexMatch!A:A=VLOOKUP(H407,'Drop Down'!K:L,2,0))*(IndexMatch!B:B=L407),0)),\"Service Already Opened\"),\"N/A\")","v":"Service Already Opened"},0,{"$f":"IF(O407>VLOOKUP(L407,'Drop Down'!$A$3:$B$10,2,0),\"1\",\"0\")","v":"0"},0,{"$f":"SUM(Table1[[#This Row],[Case Aide Hours]],Table1[[#This Row],[Case Aide Travel Time]])","v":0},{"$f":"IFERROR(IF(OR(Table1[[#This Row],[Child Support Level]]=\"Support Services Lvl 1\", Table1[[#This Row],[Child Support Level]]=\"Support Services Lvl 2\",Table1[[#This Row],[Child Support Level]]=\"Select\"),\"Case Aid Not Allowed\", PRODUCT(Table1[[#This Row],[Total Case Aide]],VLOOKUP(Table1[[#This Row],[County Where Youth Resides]],'Drop Down'!K:M,3,0))),\"0\")","v":"Case Aid Not Allowed"},"No",0,0]
["Select","-","-","-","-","DD/MM/YYYY","DD/MM/YYYY","Select","Select",{"$f":"VLOOKUP(Table1[[#This Row],[DCYF Case Region]],'Drop Down'!$F$3:$G$9,2,0)","v":"Select"},"Select","Select","Select",{"$f":"IFERROR(IF(M408=\"No\",INDEX(IndexMatch!C:C,MATCH(1,(IndexMatch!A:A=VLOOKUP(H408,'Drop Down'!K:L,2,0))*(IndexMatch!B:B=L408),0)),\"Service Already Opened\"),\"N/A\")","v":"Service Already Opened"},0,{"$f":"IF(O408>VLOOKUP(L408,'Drop Down'!$A$3:$B$10,2,0),\"1\",\"0\")","v":"0"},0,{"$f":"SUM(Table1[[#This Row],[Case Aide Hours]],Table1[[#This Row],[Case Aide Travel Time]])","v":0},{"$f":"IFERROR(IF(OR(Table1[[#This Row],[Child Support Level]]=\"Support Services Lvl 1\", Table1[[#This Row],[Child Support Level]]=\"Support Services Lvl 2\",Table1[[#This Row],[Child Support Level]]=\"Select\"),\"Case Aid Not Allowed\", PRODUCT(Table1[[#This Row],[Total Case Aide]],VLOOKUP(Table1[[#This Row],[County Where Youth Resides]],'Drop Down'!K:M,3,0))),\"0\")","v":"Case Aid Not Allowed"},"No",0,0]
["Select","-","-","-","-","DD/MM/YYYY","DD/MM/YYYY","Select","Select",{"$f":"VLOOKUP(Table1[[#This Row],[DCYF Case Region]],'Drop Down'!$F$3:$G$9,2,0)","v":"Select"},"Select","Select","Select",{"$f":"IFERROR(IF(M409=\"No\",INDEX(IndexMatch!C:C,MATCH(1,(IndexMatch!A:A=VLOOKUP(H409,'Drop Down'!K:L,2,0))*(IndexMatch!B:B=L409),0)),\"Service Already Opened\"),\"N/A\")","v":"Service Already Opened"},0,{"$f":"IF(O409>VLOOKUP(L409,'Drop Down'!$A$3:$B$10,2,0),\"1\",\"0\")","v":"0"},0,{"$f":"SUM(Table1[[#This Row],[Case Aide Hours]],Table1[[#This Row],[Case Aide Travel Time]])","v":0},{"$f":"IFERROR(IF(OR(Table1[[#This Row],[Child Support Level]]=\"Support Services Lvl 1\", Table1[[#This Row],[Child Support Level]]=\"Support Services Lvl 2\",Table1[[#This Row],[Child Support Level]]=\"Select\"),\"Case Aid Not Allowed\", PRODUCT(Table1[[#This Row],[Total Case Aide]],VLOOKUP(Table1[[#This Row],[County Where Youth Resides]],'Drop Down'!K:M,3,0))),\"0\")","v":"Case Aid Not Allowed"},"No",0,0]
["Select","-","-","-","-","DD/MM/YYYY","DD/MM/YYYY","Select","Select",{"$f":"VLOOKUP(Table1[[#This Row],[DCYF Case Region]],'Drop Down'!$F$3:$G$9,2,0)","v":"Select"},"Select","Select","Select",{"$f":"IFERROR(IF(M410=\"No\",INDEX(IndexMatch!C:C,MATCH(1,(IndexMatch!A:A=VLOOKUP(H410,'Drop Down'!K:L,2,0))*(IndexMatch!B:B=L410),0)),\"Service Already Opened\"),\"N/A\")","v":"Service Already Opened"},0,{"$f":"IF(O410>VLOOKUP(L410,'Drop Down'!$A$3:$B$10,2,0),\"1\",\"0\")","v":"0"},0,{"$f":"SUM(Table1[[#This Row],[Case Aide Hours]],Table1[[#This Row],[Case Aide Travel Time]])","v":0},{"$f":"IFERROR(IF(OR(Table1[[#This Row],[Child Support Level]]=\"Support Services Lvl 1\", Table1[[#This Row],[Child Support Level]]=\"Support Services Lvl 2\",Table1[[#This Row],[Child Support Level]]=\"Select\"),\"Case Aid Not Allowed\", PRODUCT(Table1[[#This Row],[Total Case Aide]],VLOOKUP(Table1[[#This Row],[County Where Youth Resides]],'Drop Down'!K:M,3,0))),\"0\")","v":"Case Aid Not Allowed"},"No",0,0]
["Select","-","-","-","-","DD/MM/YYYY","DD/MM/YYYY","Select","Select",{"$f":"VLOOKUP(Table1[[#This Row],[DCYF Case Region]],'Drop Down'!$F$3:$G$9,2,0)","v":"Select"},"Select","Select","Select",{"$f":"IFERROR(IF(M411=\"No\",INDEX(IndexMatch!C:C,MATCH(1,(IndexMatch!A:A=VLOOKUP(H411,'Drop Down'!K:L,2,0))*(IndexMatch!B:B=L411),0)),\"Service Already Opened\"),\"N/A\")","v":"Service Already Opened"},0,{"$f":"IF(O411>VLOOKUP(L411,'Drop Down'!$A$3:$B$10,2,0),\"1\",\"0\")","v":"0"},0,{"$f":"SUM(Table1[[#This Row],[Case Aide Hours]],Table1[[#This Row],[Case Aide Travel Time]])","v":0},{"$f":"IFERROR(IF(OR(Table1[[#This Row],[Child Support Level]]=\"Support Services Lvl 1\", Table1[[#This Row],[Child Support Level]]=\"Support Services Lvl 2\",Table1[[#This Row],[Child Support Level]]=\"Select\"),\"Case Aid Not Allowed\", PRODUCT(Table1[[#This Row],[Total Case Aide]],VLOOKUP(Table1[[#This Row],[County Where Youth Resides]],'Drop Down'!K:M,3,0))),\"0\")","v":"Case Aid Not Allowed"},"No",0,0]
["Select","-","-","-","-","DD/MM/YYYY","DD/MM/YYYY","Select","Select",{"$f":"VLOOKUP(Table1[[#This Row],[DCYF Case Region]],'Drop Down'!$F$3:$G$9,2,0)","v":"Select"},"Select","Select","Select",{"$f":"IFERROR(IF(M412=\"No\",INDEX(IndexMatch!C:C,MATCH(1,(IndexMatch!A:A=VLOOKUP(H412,'Drop Down'!K:L,2,0))*(IndexMatch!B:B=L412),0)),\"Service Already Opened\"),\"N/A\")","v":"Service Already Opened"},0,{"$f":"IF(O412>VLOOKUP(L412,'Drop Down'!$A$3:$B$10,2,0),\"1\",\"0\")","v":"0"},0,{"$f":"SUM(Table1[[#This Row],[Case Aide Hours]],Table1[[#This Row],[Case Aide Travel Time]])","v":0},{"$f":"IFERROR(IF(OR(Table1[[#This Row],[Child Support Level]]=\"Support Services Lvl 1\", Table1[[#This Row],[Child Support Level]]=\"Support Services Lvl 2\",Table1[[#This Row],[Child Support Level]]=\"Select\"),\"Case Aid Not Allowed\", PRODUCT(Table1[[#This Row],[Total Case Aide]],VLOOKUP(Table1[[#This Row],[County Where Youth Resides]],'Drop Down'!K:M,3,0))),\"0\")","v":"Case Aid Not Allowed"},"No",0,0]
["Select","-","-","-","-","DD/MM/YYYY","DD/MM/YYYY","Select","Select",{"$f":"VLOOKUP(Table1[[#This Row],[DCYF Case Region]],'Drop Down'!$F$3:$G$9,2,0)","v":"Select"},"Select","Select","Select",{"$f":"IFERROR(IF(M413=\"No\",INDEX(IndexMatch!C:C,MATCH(1,(IndexMatch!A:A=VLOOKUP(H413,'Drop Down'!K:L,2,0))*(IndexMatch!B:B=L413),0)),\"Service Already Opened\"),\"N/A\")","v":"Service Already Opened"},0,{"$f":"IF(O413>VLOOKUP(L413,'Drop Down'!$A$3:$B$10,2,0),\"1\",\"0\")","v":"0"},0,{"$f":"SUM(Table1[[#This Row],[Case Aide Hours]],Table1[[#This Row],[Case Aide Travel Time]])","v":0},{"$f":"IFERROR(IF(OR(Table1[[#This Row],[Child Support Level]]=\"Support Services Lvl 1\", Table1[[#This Row],[Child Support Level]]=\"Support Services Lvl 2\",Table1[[#This Row],[Child Support Level]]=\"Select\"),\"Case Aid Not Allowed\", PRODUCT(Table1[[#This Row],[Total Case Aide]],VLOOKUP(Table1[[#This Row],[County Where Youth Resides]],'Drop Down'!K:M,3,0))),\"0\")","v":"Case Aid Not Allowed"},"No",0,0]
["Select","-","-","-","-","DD/MM/YYYY","DD/MM/YYYY","Select","Select",{"$f":"VLOOKUP(Table1[[#This Row],[DCYF Case Region]],'Drop Down'!$F$3:$G$9,2,0)","v":"Select"},"Select","Select","Select",{"$f":"IFERROR(IF(M414=\"No\",INDEX(IndexMatch!C:C,MATCH(1,(IndexMatch!A:A=VLOOKUP(H414,'Drop Down'!K:L,2,0))*(IndexMatch!B:B=L414),0)),\"Service Already Opened\"),\"N/A\")","v":"Service Already Opened"},0,{"$f":"IF(O414>VLOOKUP(L414,'Drop Down'!$A$3:$B$10,2,0),\"1\",\"0\")","v":"0"},0,{"$f":"SUM(Table1[[#This Row],[Case Aide Hours]],Table1[[#This Row],[Case Aide Travel Time]])","v":0},{"$f":"IFERROR(IF(OR(Table1[[#This Row],[Child Support Level]]=\"Support Services Lvl 1\", Table1[[#This Row],[Child Support Level]]=\"Support Services Lvl 2\",Table1[[#This Row],[Child Support Level]]=\"Select\"),\"Case Aid Not Allowed\", PRODUCT(Table1[[#This Row],[Total Case Aide]],VLOOKUP(Table1[[#This Row],[County Where Youth Resides]],'Drop Down'!K:M,3,0))),\"0\")","v":"Case Aid Not Allowed"},"No",0,0]
["Select","-","-","-","-","DD/MM/YYYY","DD/MM/YYYY","Select","Select",{"$f":"VLOOKUP(Table1[[#This Row],[DCYF Case Region]],'Drop Down'!$F$3:$G$9,2,0)","v":"Select"},"Select","Select","Select",{"$f":"IFERROR(IF(M415=\"No\",INDEX(IndexMatch!C:C,MATCH(1,(IndexMatch!A:A=VLOOKUP(H415,'Drop Down'!K:L,2,0))*(IndexMatch!B:B=L415),0)),\"Service Already Opened\"),\"N/A\")","v":"Service Already Opened"},0,{"$f":"IF(O415>VLOOKUP(L415,'Drop Down'!$A$3:$B$10,2,0),\"1\",\"0\")","v":"0"},0,{"$f":"SUM(Table1[[#This Row],[Case Aide Hours]],Table1[[#This Row],[Case Aide Travel Time]])","v":0},{"$f":"IFERROR(IF(OR(Table1[[#This Row],[Child Support Level]]=\"Support Services Lvl 1\", Table1[[#This Row],[Child Support Level]]=\"Support Services Lvl 2\",Table1[[#This Row],[Child Support Level]]=\"Select\"),\"Case Aid Not Allowed\", PRODUCT(Table1[[#This Row],[Total Case Aide]],VLOOKUP(Table1[[#This Row],[County Where Youth Resides]],'Drop Down'!K:M,3,0))),\"0\")","v":"Case Aid Not Allowed"},"No",0,0]
["Select","-","-","-","-","DD/MM/YYYY","DD/MM/YYYY","Select","Select",{"$f":"VLOOKUP(Table1[[#This Row],[DCYF Case Region]],'Drop Down'!$F$3:$G$9,2,0)","v":"Select"},"Select","Select","Select",{"$f":"IFERROR(IF(M416=\"No\",INDEX(IndexMatch!C:C,MATCH(1,(IndexMatch!A:A=VLOOKUP(H416,'Drop Down'!K:L,2,0))*(IndexMatch!B:B=L416),0)),\"Service Already Opened\"),\"N/A\")","v":"Service Already Opened"},0,{"$f":"IF(O416>VLOOKUP(L416,'Drop Down'!$A$3:$B$10,2,0),\"1\",\"0\")","v":"0"},0,{"$f":"SUM(Table1[[#This Row],[Case Aide Hours]],Table1[[#This Row],[Case Aide Travel Time]])","v":0},{"$f":"IFERROR(IF(OR(Table1[[#This Row],[Child Support Level]]=\"Support Services Lvl 1\", Table1[[#This Row],[Child Support Level]]=\"Support Services Lvl 2\",Table1[[#This Row],[Child Support Level]]=\"Select\"),\"Case Aid Not Allowed\", PRODUCT(Table1[[#This Row],[Total Case Aide]],VLOOKUP(Table1[[#This Row],[County Where Youth Resides]],'Drop Down'!K:M,3,0))),\"0\")","v":"Case Aid Not Allowed"},"No",0,0]
["Select","-","-","-","-","DD/MM/YYYY","DD/MM/YYYY","Select","Select",{"$f":"VLOOKUP(Table1[[#This Row],[DCYF Case Region]],'Drop Down'!$F$3:$G$9,2,0)","v":"Select"},"Select","Select","Select",{"$f":"IFERROR(IF(M417=\"No\",INDEX(IndexMatch!C:C,MATCH(1,(IndexMatch!A:A=VLOOKUP(H417,'Drop Down'!K:L,2,0))*(IndexMatch!B:B=L417),0)),\"Service Already Opened\"),\"N/A\")","v":"Service Already Opened"},0,{"$f":"IF(O417>VLOOKUP(L417,'Drop Down'!$A$3:$B$10,2,0),\"1\",\"0\")","v":"0"},0,{"$f":"SUM(Table1[[#This Row],[Case Aide Hours]],Table1[[#This Row],[Case Aide Travel Time]])","v":0},{"$f":"IFERROR(IF(OR(Table1[[#This Row],[Child Support Level]]=\"Support Services Lvl 1\", Table1[[#This Row],[Child Support Level]]=\"Support Services Lvl 2\",Table1[[#This Row],[Child Support Level]]=\"Select\"),\"Case Aid Not Allowed\", PRODUCT(Table1[[#This Row],[Total Case Aide]],VLOOKUP(Table1[[#This Row],[County Where Youth Resides]],'Drop Down'!K:M,3,0))),\"0\")","v":"Case Aid Not Allowed"},"No",0,0]
["Select","-","-","-","-","DD/MM/YYYY","DD/MM/YYYY","Select","Select",{"$f":"VLOOKUP(Table1[[#This Row],[DCYF Case Region]],'Drop Down'!$F$3:$G$9,2,0)","v":"Select"},"Select","Select","Select",{"$f":"IFERROR(IF(M418=\"No\",INDEX(IndexMatch!C:C,MATCH(1,(IndexMatch!A:A=VLOOKUP(H418,'Drop Down'!K:L,2,0))*(IndexMatch!B:B=L418),0)),\"Service Already Opened\"),\"N/A\")","v":"Service Already Opened"},0,{"$f":"IF(O418>VLOOKUP(L418,'Drop Down'!$A$3:$B$10,2,0),\"1\",\"0\")","v":"0"},0,{"$f":"SUM(Table1[[#This Row],[Case Aide Hours]],Table1[[#This Row],[Case Aide Travel Time]])","v":0},{"$f":"IFERROR(IF(OR(Table1[[#This Row],[Child Support Level]]=\"Support Services Lvl 1\", Table1[[#This Row],[Child Support Level]]=\"Support Services Lvl 2\",Table1[[#This Row],[Child Support Level]]=\"Select\"),\"Case Aid Not Allowed\", PRODUCT(Table1[[#This Row],[Total Case Aide]],VLOOKUP(Table1[[#This Row],[County Where Youth Resides]],'Drop Down'!K:M,3,0))),\"0\")","v":"Case Aid Not Allowed"},"No",0,0]
["Select","-","-","-","-","DD/MM/YYYY","DD/MM/YYYY","Select","Select",{"$f":"VLOOKUP(Table1[[#This Row],[DCYF Case Region]],'Drop Down'!$F$3:$G$9,2,0)","v":"Select"},"Select","Select","Select",{"$f":"IFERROR(IF(M419=\"No\",INDEX(IndexMatch!C:C,MATCH(1,(IndexMatch!A:A=VLOOKUP(H419,'Drop Down'!K:L,2,0))*(IndexMatch!B:B=L419),0)),\"Service Already Opened\"),\"N/A\")","v":"Service Already Opened"},0,{"$f":"IF(O419>VLOOKUP(L419,'Drop Down'!$A$3:$B$10,2,0),\"1\",\"0\")","v":"0"},0,{"$f":"SUM(Table1[[#This Row],[Case Aide Hours]],Table1[[#This Row],[Case Aide Travel Time]])","v":0},{"$f":"IFERROR(IF(OR(Table1[[#This Row],[Child Support Level]]=\"Support Services Lvl 1\", Table1[[#This Row],[Child Support Level]]=\"Support Services Lvl 2\",Table1[[#This Row],[Child Support Level]]=\"Select\"),\"Case Aid Not Allowed\", PRODUCT(Table1[[#This Row],[Total Case Aide]],VLOOKUP(Table1[[#This Row],[County Where Youth Resides]],'Drop Down'!K:M,3,0))),\"0\")","v":"Case Aid Not Allowed"},"No",0,0]
["Select","-","-","-","-","DD/MM/YYYY","DD/MM/YYYY","Select","Select",{"$f":"VLOOKUP(Table1[[#This Row],[DCYF Case Region]],'Drop Down'!$F$3:$G$9,2,0)","v":"Select"},"Select","Select","Select",{"$f":"IFERROR(IF(M420=\"No\",INDEX(IndexMatch!C:C,MATCH(1,(IndexMatch!A:A=VLOOKUP(H420,'Drop Down'!K:L,2,0))*(IndexMatch!B:B=L420),0)),\"Service Already Opened\"),\"N/A\")","v":"Service Already Opened"},0,{"$f":"IF(O420>VLOOKUP(L420,'Drop Down'!$A$3:$B$10,2,0),\"1\",\"0\")","v":"0"},0,{"$f":"SUM(Table1[[#This Row],[Case Aide Hours]],Table1[[#This Row],[Case Aide Travel Time]])","v":0},{"$f":"IFERROR(IF(OR(Table1[[#This Row],[Child Support Level]]=\"Support Services Lvl 1\", Table1[[#This Row],[Child Support Level]]=\"Support Services Lvl 2\",Table1[[#This Row],[Child Support Level]]=\"Select\"),\"Case Aid Not Allowed\", PRODUCT(Table1[[#This Row],[Total Case Aide]],VLOOKUP(Table1[[#This Row],[County Where Youth Resides]],'Drop Down'!K:M,3,0))),\"0\")","v":"Case Aid Not Allowed"},"No",0,0]
["Select","-","-","-","-","DD/MM/YYYY","DD/MM/YYYY","Select","Select",{"$f":"VLOOKUP(Table1[[#This Row],[DCYF Case Region]],'Drop Down'!$F$3:$G$9,2,0)","v":"Select"},"Select","Select","Select",{"$f":"IFERROR(IF(M421=\"No\",INDEX(IndexMatch!C:C,MATCH(1,(IndexMatch!A:A=VLOOKUP(H421,'Drop Down'!K:L,2,0))*(IndexMatch!B:B=L421),0)),\"Service Already Opened\"),\"N/A\")","v":"Service Already Opened"},0,{"$f":"IF(O421>VLOOKUP(L421,'Drop Down'!$A$3:$B$10,2,0),\"1\",\"0\")","v":"0"},0,{"$f":"SUM(Table1[[#This Row],[Case Aide Hours]],Table1[[#This Row],[Case Aide Travel Time]])","v":0},{"$f":"IFERROR(IF(OR(Table1[[#This Row],[Child Support Level]]=\"Support Services Lvl 1\", Table1[[#This Row],[Child Support Level]]=\"Support Services Lvl 2\",Table1[[#This Row],[Child Support Level]]=\"Select\"),\"Case Aid Not Allowed\", PRODUCT(Table1[[#This Row],[Total Case Aide]],VLOOKUP(Table1[[#This Row],[County Where Youth Resides]],'Drop Down'!K:M,3,0))),\"0\")","v":"Case Aid Not Allowed"},"No",0,0]
["Select","-","-","-","-","DD/MM/YYYY","DD/MM/YYYY","Select","Select",{"$f":"VLOOKUP(Table1[[#This Row],[DCYF Case Region]],'Drop Down'!$F$3:$G$9,2,0)","v":"Select"},"Select","Select","Select",{"$f":"IFERROR(IF(M422=\"No\",INDEX(IndexMatch!C:C,MATCH(1,(IndexMatch!A:A=VLOOKUP(H422,'Drop Down'!K:L,2,0))*(IndexMatch!B:B=L422),0)),\"Service Already Opened\"),\"N/A\")","v":"Service Already Opened"},0,{"$f":"IF(O422>VLOOKUP(L422,'Drop Down'!$A$3:$B$10,2,0),\"1\",\"0\")","v":"0"},0,{"$f":"SUM(Table1[[#This Row],[Case Aide Hours]],Table1[[#This Row],[Case Aide Travel Time]])","v":0},{"$f":"IFERROR(IF(OR(Table1[[#This Row],[Child Support Level]]=\"Support Services Lvl 1\", Table1[[#This Row],[Child Support Level]]=\"Support Services Lvl 2\",Table1[[#This Row],[Child Support Level]]=\"Select\"),\"Case Aid Not Allowed\", PRODUCT(Table1[[#This Row],[Total Case Aide]],VLOOKUP(Table1[[#This Row],[County Where Youth Resides]],'Drop Down'!K:M,3,0))),\"0\")","v":"Case Aid Not Allowed"},"No",0,0]
["Select","-","-","-","-","DD/MM/YYYY","DD/MM/YYYY","Select","Select",{"$f":"VLOOKUP(Table1[[#This Row],[DCYF Case Region]],'Drop Down'!$F$3:$G$9,2,0)","v":"Select"},"Select","Select","Select",{"$f":"IFERROR(IF(M423=\"No\",INDEX(IndexMatch!C:C,MATCH(1,(IndexMatch!A:A=VLOOKUP(H423,'Drop Down'!K:L,2,0))*(IndexMatch!B:B=L423),0)),\"Service Already Opened\"),\"N/A\")","v":"Service Already Opened"},0,{"$f":"IF(O423>VLOOKUP(L423,'Drop Down'!$A$3:$B$10,2,0),\"1\",\"0\")","v":"0"},0,{"$f":"SUM(Table1[[#This Row],[Case Aide Hours]],Table1[[#This Row],[Case Aide Travel Time]])","v":0},{"$f":"IFERROR(IF(OR(Table1[[#This Row],[Child Support Level]]=\"Support Services Lvl 1\", Table1[[#This Row],[Child Support Level]]=\"Support Services Lvl 2\",Table1[[#This Row],[Child Support Level]]=\"Select\"),\"Case Aid Not Allowed\", PRODUCT(Table1[[#This Row],[Total Case Aide]],VLOOKUP(Table1[[#This Row],[County Where Youth Resides]],'Drop Down'!K:M,3,0))),\"0\")","v":"Case Aid Not Allowed"},"No",0,0]
["Select","-","-","-","-","DD/MM/YYYY","DD/MM/YYYY","Select","Select",{"$f":"VLOOKUP(Table1[[#This Row],[DCYF Case Region]],'Drop Down'!$F$3:$G$9,2,0)","v":"Select"},"Select","Select","Select",{"$f":"IFERROR(IF(M424=\"No\",INDEX(IndexMatch!C:C,MATCH(1,(IndexMatch!A:A=VLOOKUP(H424,'Drop Down'!K:L,2,0))*(IndexMatch!B:B=L424),0)),\"Service Already Opened\"),\"N/A\")","v":"Service Already Opened"},0,{"$f":"IF(O424>VLOOKUP(L424,'Drop Down'!$A$3:$B$10,2,0),\"1\",\"0\")","v":"0"},0,{"$f":"SUM(Table1[[#This Row],[Case Aide Hours]],Table1[[#This Row],[Case Aide Travel Time]])","v":0},{"$f":"IFERROR(IF(OR(Table1[[#This Row],[Child Support Level]]=\"Support Services Lvl 1\", Table1[[#This Row],[Child Support Level]]=\"Support Services Lvl 2\",Table1[[#This Row],[Child Support Level]]=\"Select\"),\"Case Aid Not Allowed\", PRODUCT(Table1[[#This Row],[Total Case Aide]],VLOOKUP(Table1[[#This Row],[County Where Youth Resides]],'Drop Down'!K:M,3,0))),\"0\")","v":"Case Aid Not Allowed"},"No",0,0]
["Select","-","-","-","-","DD/MM/YYYY","DD/MM/YYYY","Select","Select",{"$f":"VLOOKUP(Table1[[#This Row],[DCYF Case Region]],'Drop Down'!$F$3:$G$9,2,0)","v":"Select"},"Select","Select","Select",{"$f":"IFERROR(IF(M425=\"No\",INDEX(IndexMatch!C:C,MATCH(1,(IndexMatch!A:A=VLOOKUP(H425,'Drop Down'!K:L,2,0))*(IndexMatch!B:B=L425),0)),\"Service Already Opened\"),\"N/A\")","v":"Service Already Opened"},0,{"$f":"IF(O425>VLOOKUP(L425,'Drop Down'!$A$3:$B$10,2,0),\"1\",\"0\")","v":"0"},0,{"$f":"SUM(Table1[[#This Row],[Case Aide Hours]],Table1[[#This Row],[Case Aide Travel Time]])","v":0},{"$f":"IFERROR(IF(OR(Table1[[#This Row],[Child Support Level]]=\"Support Services Lvl 1\", Table1[[#This Row],[Child Support Level]]=\"Support Services Lvl 2\",Table1[[#This Row],[Child Support Level]]=\"Select\"),\"Case Aid Not Allowed\", PRODUCT(Table1[[#This Row],[Total Case Aide]],VLOOKUP(Table1[[#This Row],[County Where Youth Resides]],'Drop Down'!K:M,3,0))),\"0\")","v":"Case Aid Not Allowed"},"No",0,0]
["Select","-","-","-","-","DD/MM/YYYY","DD/MM/YYYY","Select","Select",{"$f":"VLOOKUP(Table1[[#This Row],[DCYF Case Region]],'Drop Down'!$F$3:$G$9,2,0)","v":"Select"},"Select","Select","Select",{"$f":"IFERROR(IF(M426=\"No\",INDEX(IndexMatch!C:C,MATCH(1,(IndexMatch!A:A=VLOOKUP(H426,'Drop Down'!K:L,2,0))*(IndexMatch!B:B=L426),0)),\"Service Already Opened\"),\"N/A\")","v":"Service Already Opened"},0,{"$f":"IF(O426>VLOOKUP(L426,'Drop Down'!$A$3:$B$10,2,0),\"1\",\"0\")","v":"0"},0,{"$f":"SUM(Table1[[#This Row],[Case Aide Hours]],Table1[[#This Row],[Case Aide Travel Time]])","v":0},{"$f":"IFERROR(IF(OR(Table1[[#This Row],[Child Support Level]]=\"Support Services Lvl 1\", Table1[[#This Row],[Child Support Level]]=\"Support Services Lvl 2\",Table1[[#This Row],[Child Support Level]]=\"Select\"),\"Case Aid Not Allowed\", PRODUCT(Table1[[#This Row],[Total Case Aide]],VLOOKUP(Table1[[#This Row],[County Where Youth Resides]],'Drop Down'!K:M,3,0))),\"0\")","v":"Case Aid Not Allowed"},"No",0,0]
["Select","-","-","-","-","DD/MM/YYYY","DD/MM/YYYY","Select","Select",{"$f":"VLOOKUP(Table1[[#This Row],[DCYF Case Region]],'Drop Down'!$F$3:$G$9,2,0)","v":"Select"},"Select","Select","Select",{"$f":"IFERROR(IF(M427=\"No\",INDEX(IndexMatch!C:C,MATCH(1,(IndexMatch!A:A=VLOOKUP(H427,'Drop Down'!K:L,2,0))*(IndexMatch!B:B=L427),0)),\"Service Already Opened\"),\"N/A\")","v":"Service Already Opened"},0,{"$f":"IF(O427>VLOOKUP(L427,'Drop Down'!$A$3:$B$10,2,0),\"1\",\"0\")","v":"0"},0,{"$f":"SUM(Table1[[#This Row],[Case Aide Hours]],Table1[[#This Row],[Case Aide Travel Time]])","v":0},{"$f":"IFERROR(IF(OR(Table1[[#This Row],[Child Support Level]]=\"Support Services Lvl 1\", Table1[[#This Row],[Child Support Level]]=\"Support Services Lvl 2\",Table1[[#This Row],[Child Support Level]]=\"Select\"),\"Case Aid Not Allowed\", PRODUCT(Table1[[#This Row],[Total Case Aide]],VLOOKUP(Table1[[#This Row],[County Where Youth Resides]],'Drop Down'!K:M,3,0))),\"0\")","v":"Case Aid Not Allowed"},"No",0,0]
["Select","-","-","-","-","DD/MM/YYYY","DD/MM/YYYY","Select","Select",{"$f":"VLOOKUP(Table1[[#This Row],[DCYF Case Region]],'Drop Down'!$F$3:$G$9,2,0)","v":"Select"},"Select","Select","Select",{"$f":"IFERROR(IF(M428=\"No\",INDEX(IndexMatch!C:C,MATCH(1,(IndexMatch!A:A=VLOOKUP(H428,'Drop Down'!K:L,2,0))*(IndexMatch!B:B=L428),0)),\"Service Already Opened\"),\"N/A\")","v":"Service Already Opened"},0,{"$f":"IF(O428>VLOOKUP(L428,'Drop Down'!$A$3:$B$10,2,0),\"1\",\"0\")","v":"0"},0,{"$f":"SUM(Table1[[#This Row],[Case Aide Hours]],Table1[[#This Row],[Case Aide Travel Time]])","v":0},{"$f":"IFERROR(IF(OR(Table1[[#This Row],[Child Support Level]]=\"Support Services Lvl 1\", Table1[[#This Row],[Child Support Level]]=\"Support Services Lvl 2\",Table1[[#This Row],[Child Support Level]]=\"Select\"),\"Case Aid Not Allowed\", PRODUCT(Table1[[#This Row],[Total Case Aide]],VLOOKUP(Table1[[#This Row],[County Where Youth Resides]],'Drop Down'!K:M,3,0))),\"0\")","v":"Case Aid Not Allowed"},"No",0,0]
["Select","-","-","-","-","DD/MM/YYYY","DD/MM/YYYY","Select","Select",{"$f":"VLOOKUP(Table1[[#This Row],[DCYF Case Region]],'Drop Down'!$F$3:$G$9,2,0)","v":"Select"},"Select","Select","Select",{"$f":"IFERROR(IF(M429=\"No\",INDEX(IndexMatch!C:C,MATCH(1,(IndexMatch!A:A=VLOOKUP(H429,'Drop Down'!K:L,2,0))*(IndexMatch!B:B=L429),0)),\"Service Already Opened\"),\"N/A\")","v":"Service Already Opened"},0,{"$f":"IF(O429>VLOOKUP(L429,'Drop Down'!$A$3:$B$10,2,0),\"1\",\"0\")","v":"0"},0,{"$f":"SUM(Table1[[#This Row],[Case Aide Hours]],Table1[[#This Row],[Case Aide Travel Time]])","v":0},{"$f":"IFERROR(IF(OR(Table1[[#This Row],[Child Support Level]]=\"Support Services Lvl 1\", Table1[[#This Row],[Child Support Level]]=\"Support Services Lvl 2\",Table1[[#This Row],[Child Support Level]]=\"Select\"),\"Case Aid Not Allowed\", PRODUCT(Table1[[#This Row],[Total Case Aide]],VLOOKUP(Table1[[#This Row],[County Where Youth Resides]],'Drop Down'!K:M,3,0))),\"0\")","v":"Case Aid Not Allowed"},"No",0,0]
["Select","-","-","-","-","DD/MM/YYYY","DD/MM/YYYY","Select","Select",{"$f":"VLOOKUP(Table1[[#This Row],[DCYF Case Region]],'Drop Down'!$F$3:$G$9,2,0)","v":"Select"},"Select","Select","Select",{"$f":"IFERROR(IF(M430=\"No\",INDEX(IndexMatch!C:C,MATCH(1,(IndexMatch!A:A=VLOOKUP(H430,'Drop Down'!K:L,2,0))*(IndexMatch!B:B=L430),0)),\"Service Already Opened\"),\"N/A\")","v":"Service Already Opened"},0,{"$f":"IF(O430>VLOOKUP(L430,'Drop Down'!$A$3:$B$10,2,0),\"1\",\"0\")","v":"0"},0,{"$f":"SUM(Table1[[#This Row],[Case Aide Hours]],Table1[[#This Row],[Case Aide Travel Time]])","v":0},{"$f":"IFERROR(IF(OR(Table1[[#This Row],[Child Support Level]]=\"Support Services Lvl 1\", Table1[[#This Row],[Child Support Level]]=\"Support Services Lvl 2\",Table1[[#This Row],[Child Support Level]]=\"Select\"),\"Case Aid Not Allowed\", PRODUCT(Table1[[#This Row],[Total Case Aide]],VLOOKUP(Table1[[#This Row],[County Where Youth Resides]],'Drop Down'!K:M,3,0))),\"0\")","v":"Case Aid Not Allowed"},"No",0,0]
["Select","-","-","-","-","DD/MM/YYYY","DD/MM/YYYY","Select","Select",{"$f":"VLOOKUP(Table1[[#This Row],[DCYF Case Region]],'Drop Down'!$F$3:$G$9,2,0)","v":"Select"},"Select","Select","Select",{"$f":"IFERROR(IF(M431=\"No\",INDEX(IndexMatch!C:C,MATCH(1,(IndexMatch!A:A=VLOOKUP(H431,'Drop Down'!K:L,2,0))*(IndexMatch!B:B=L431),0)),\"Service Already Opened\"),\"N/A\")","v":"Service Already Opened"},0,{"$f":"IF(O431>VLOOKUP(L431,'Drop Down'!$A$3:$B$10,2,0),\"1\",\"0\")","v":"0"},0,{"$f":"SUM(Table1[[#This Row],[Case Aide Hours]],Table1[[#This Row],[Case Aide Travel Time]])","v":0},{"$f":"IFERROR(IF(OR(Table1[[#This Row],[Child Support Level]]=\"Support Services Lvl 1\", Table1[[#This Row],[Child Support Level]]=\"Support Services Lvl 2\",Table1[[#This Row],[Child Support Level]]=\"Select\"),\"Case Aid Not Allowed\", PRODUCT(Table1[[#This Row],[Total Case Aide]],VLOOKUP(Table1[[#This Row],[County Where Youth Resides]],'Drop Down'!K:M,3,0))),\"0\")","v":"Case Aid Not Allowed"},"No",0,0]
["Select","-","-","-","-","DD/MM/YYYY","DD/MM/YYYY","Select","Select",{"$f":"VLOOKUP(Table1[[#This Row],[DCYF Case Region]],'Drop Down'!$F$3:$G$9,2,0)","v":"Select"},"Select","Select","Select",{"$f":"IFERROR(IF(M432=\"No\",INDEX(IndexMatch!C:C,MATCH(1,(IndexMatch!A:A=VLOOKUP(H432,'Drop Down'!K:L,2,0))*(IndexMatch!B:B=L432),0)),\"Service Already Opened\"),\"N/A\")","v":"Service Already Opened"},0,{"$f":"IF(O432>VLOOKUP(L432,'Drop Down'!$A$3:$B$10,2,0),\"1\",\"0\")","v":"0"},0,{"$f":"SUM(Table1[[#This Row],[Case Aide Hours]],Table1[[#This Row],[Case Aide Travel Time]])","v":0},{"$f":"IFERROR(IF(OR(Table1[[#This Row],[Child Support Level]]=\"Support Services Lvl 1\", Table1[[#This Row],[Child Support Level]]=\"Support Services Lvl 2\",Table1[[#This Row],[Child Support Level]]=\"Select\"),\"Case Aid Not Allowed\", PRODUCT(Table1[[#This Row],[Total Case Aide]],VLOOKUP(Table1[[#This Row],[County Where Youth Resides]],'Drop Down'!K:M,3,0))),\"0\")","v":"Case Aid Not Allowed"},"No",0,0]
["Select","-","-","-","-","DD/MM/YYYY","DD/MM/YYYY","Select","Select",{"$f":"VLOOKUP(Table1[[#This Row],[DCYF Case Region]],'Drop Down'!$F$3:$G$9,2,0)","v":"Select"},"Select","Select","Select",{"$f":"IFERROR(IF(M433=\"No\",INDEX(IndexMatch!C:C,MATCH(1,(IndexMatch!A:A=VLOOKUP(H433,'Drop Down'!K:L,2,0))*(IndexMatch!B:B=L433),0)),\"Service Already Opened\"),\"N/A\")","v":"Service Already Opened"},0,{"$f":"IF(O433>VLOOKUP(L433,'Drop Down'!$A$3:$B$10,2,0),\"1\",\"0\")","v":"0"},0,{"$f":"SUM(Table1[[#This Row],[Case Aide Hours]],Table1[[#This Row],[Case Aide Travel Time]])","v":0},{"$f":"IFERROR(IF(OR(Table1[[#This Row],[Child Support Level]]=\"Support Services Lvl 1\", Table1[[#This Row],[Child Support Level]]=\"Support Services Lvl 2\",Table1[[#This Row],[Child Support Level]]=\"Select\"),\"Case Aid Not Allowed\", PRODUCT(Table1[[#This Row],[Total Case Aide]],VLOOKUP(Table1[[#This Row],[County Where Youth Resides]],'Drop Down'!K:M,3,0))),\"0\")","v":"Case Aid Not Allowed"},"No",0,0]
["Select","-","-","-","-","DD/MM/YYYY","DD/MM/YYYY","Select","Select",{"$f":"VLOOKUP(Table1[[#This Row],[DCYF Case Region]],'Drop Down'!$F$3:$G$9,2,0)","v":"Select"},"Select","Select","Select",{"$f":"IFERROR(IF(M434=\"No\",INDEX(IndexMatch!C:C,MATCH(1,(IndexMatch!A:A=VLOOKUP(H434,'Drop Down'!K:L,2,0))*(IndexMatch!B:B=L434),0)),\"Service Already Opened\"),\"N/A\")","v":"Service Already Opened"},0,{"$f":"IF(O434>VLOOKUP(L434,'Drop Down'!$A$3:$B$10,2,0),\"1\",\"0\")","v":"0"},0,{"$f":"SUM(Table1[[#This Row],[Case Aide Hours]],Table1[[#This Row],[Case Aide Travel Time]])","v":0},{"$f":"IFERROR(IF(OR(Table1[[#This Row],[Child Support Level]]=\"Support Services Lvl 1\", Table1[[#This Row],[Child Support Level]]=\"Support Services Lvl 2\",Table1[[#This Row],[Child Support Level]]=\"Select\"),\"Case Aid Not Allowed\", PRODUCT(Table1[[#This Row],[Total Case Aide]],VLOOKUP(Table1[[#This Row],[County Where Youth Resides]],'Drop Down'!K:M,3,0))),\"0\")","v":"Case Aid Not Allowed"},"No",0,0]
["Select","-","-","-","-","DD/MM/YYYY","DD/MM/YYYY","Select","Select",{"$f":"VLOOKUP(Table1[[#This Row],[DCYF Case Region]],'Drop Down'!$F$3:$G$9,2,0)","v":"Select"},"Select","Select","Select",{"$f":"IFERROR(IF(M435=\"No\",INDEX(IndexMatch!C:C,MATCH(1,(IndexMatch!A:A=VLOOKUP(H435,'Drop Down'!K:L,2,0))*(IndexMatch!B:B=L435),0)),\"Service Already Opened\"),\"N/A\")","v":"Service Already Opened"},0,{"$f":"IF(O435>VLOOKUP(L435,'Drop Down'!$A$3:$B$10,2,0),\"1\",\"0\")","v":"0"},0,{"$f":"SUM(Table1[[#This Row],[Case Aide Hours]],Table1[[#This Row],[Case Aide Travel Time]])","v":0},{"$f":"IFERROR(IF(OR(Table1[[#This Row],[Child Support Level]]=\"Support Services Lvl 1\", Table1[[#This Row],[Child Support Level]]=\"Support Services Lvl 2\",Table1[[#This Row],[Child Support Level]]=\"Select\"),\"Case Aid Not Allowed\", PRODUCT(Table1[[#This Row],[Total Case Aide]],VLOOKUP(Table1[[#This Row],[County Where Youth Resides]],'Drop Down'!K:M,3,0))),\"0\")","v":"Case Aid Not Allowed"},"No",0,0]
["Select","-","-","-","-","DD/MM/YYYY","DD/MM/YYYY","Select","Select",{"$f":"VLOOKUP(Table1[[#This Row],[DCYF Case Region]],'Drop Down'!$F$3:$G$9,2,0)","v":"Select"},"Select","Select","Select",{"$f":"IFERROR(IF(M436=\"No\",INDEX(IndexMatch!C:C,MATCH(1,(IndexMatch!A:A=VLOOKUP(H436,'Drop Down'!K:L,2,0))*(IndexMatch!B:B=L436),0)),\"Service Already Opened\"),\"N/A\")","v":"Service Already Opened"},0,{"$f":"IF(O436>VLOOKUP(L436,'Drop Down'!$A$3:$B$10,2,0),\"1\",\"0\")","v":"0"},0,{"$f":"SUM(Table1[[#This Row],[Case Aide Hours]],Table1[[#This Row],[Case Aide Travel Time]])","v":0},{"$f":"IFERROR(IF(OR(Table1[[#This Row],[Child Support Level]]=\"Support Services Lvl 1\", Table1[[#This Row],[Child Support Level]]=\"Support Services Lvl 2\",Table1[[#This Row],[Child Support Level]]=\"Select\"),\"Case Aid Not Allowed\", PRODUCT(Table1[[#This Row],[Total Case Aide]],VLOOKUP(Table1[[#This Row],[County Where Youth Resides]],'Drop Down'!K:M,3,0))),\"0\")","v":"Case Aid Not Allowed"},"No",0,0]
["Select","-","-","-","-","DD/MM/YYYY","DD/MM/YYYY","Select","Select",{"$f":"VLOOKUP(Table1[[#This Row],[DCYF Case Region]],'Drop Down'!$F$3:$G$9,2,0)","v":"Select"},"Select","Select","Select",{"$f":"IFERROR(IF(M437=\"No\",INDEX(IndexMatch!C:C,MATCH(1,(IndexMatch!A:A=VLOOKUP(H437,'Drop Down'!K:L,2,0))*(IndexMatch!B:B=L437),0)),\"Service Already Opened\"),\"N/A\")","v":"Service Already Opened"},0,{"$f":"IF(O437>VLOOKUP(L437,'Drop Down'!$A$3:$B$10,2,0),\"1\",\"0\")","v":"0"},0,{"$f":"SUM(Table1[[#This Row],[Case Aide Hours]],Table1[[#This Row],[Case Aide Travel Time]])","v":0},{"$f":"IFERROR(IF(OR(Table1[[#This Row],[Child Support Level]]=\"Support Services Lvl 1\", Table1[[#This Row],[Child Support Level]]=\"Support Services Lvl 2\",Table1[[#This Row],[Child Support Level]]=\"Select\"),\"Case Aid Not Allowed\", PRODUCT(Table1[[#This Row],[Total Case Aide]],VLOOKUP(Table1[[#This Row],[County Where Youth Resides]],'Drop Down'!K:M,3,0))),\"0\")","v":"Case Aid Not Allowed"},"No",0,0]
["Select","-","-","-","-","DD/MM/YYYY","DD/MM/YYYY","Select","Select",{"$f":"VLOOKUP(Table1[[#This Row],[DCYF Case Region]],'Drop Down'!$F$3:$G$9,2,0)","v":"Select"},"Select","Select","Select",{"$f":"IFERROR(IF(M438=\"No\",INDEX(IndexMatch!C:C,MATCH(1,(IndexMatch!A:A=VLOOKUP(H438,'Drop Down'!K:L,2,0))*(IndexMatch!B:B=L438),0)),\"Service Already Opened\"),\"N/A\")","v":"Service Already Opened"},0,{"$f":"IF(O438>VLOOKUP(L438,'Drop Down'!$A$3:$B$10,2,0),\"1\",\"0\")","v":"0"},0,{"$f":"SUM(Table1[[#This Row],[Case Aide Hours]],Table1[[#This Row],[Case Aide Travel Time]])","v":0},{"$f":"IFERROR(IF(OR(Table1[[#This Row],[Child Support Level]]=\"Support Services Lvl 1\", Table1[[#This Row],[Child Support Level]]=\"Support Services Lvl 2\",Table1[[#This Row],[Child Support Level]]=\"Select\"),\"Case Aid Not Allowed\", PRODUCT(Table1[[#This Row],[Total Case Aide]],VLOOKUP(Table1[[#This Row],[County Where Youth Resides]],'Drop Down'!K:M,3,0))),\"0\")","v":"Case Aid Not Allowed"},"No",0,0]
["Select","-","-","-","-","DD/MM/YYYY","DD/MM/YYYY","Select","Select",{"$f":"VLOOKUP(Table1[[#This Row],[DCYF Case Region]],'Drop Down'!$F$3:$G$9,2,0)","v":"Select"},"Select","Select","Select",{"$f":"IFERROR(IF(M439=\"No\",INDEX(IndexMatch!C:C,MATCH(1,(IndexMatch!A:A=VLOOKUP(H439,'Drop Down'!K:L,2,0))*(IndexMatch!B:B=L439),0)),\"Service Already Opened\"),\"N/A\")","v":"Service Already Opened"},0,{"$f":"IF(O439>VLOOKUP(L439,'Drop Down'!$A$3:$B$10,2,0),\"1\",\"0\")","v":"0"},0,{"$f":"SUM(Table1[[#This Row],[Case Aide Hours]],Table1[[#This Row],[Case Aide Travel Time]])","v":0},{"$f":"IFERROR(IF(OR(Table1[[#This Row],[Child Support Level]]=\"Support Services Lvl 1\", Table1[[#This Row],[Child Support Level]]=\"Support Services Lvl 2\",Table1[[#This Row],[Child Support Level]]=\"Select\"),\"Case Aid Not Allowed\", PRODUCT(Table1[[#This Row],[Total Case Aide]],VLOOKUP(Table1[[#This Row],[County Where Youth Resides]],'Drop Down'!K:M,3,0))),\"0\")","v":"Case Aid Not Allowed"},"No",0,0]
["Select","-","-","-","-","DD/MM/YYYY","DD/MM/YYYY","Select","Select",{"$f":"VLOOKUP(Table1[[#This Row],[DCYF Case Region]],'Drop Down'!$F$3:$G$9,2,0)","v":"Select"},"Select","Select","Select",{"$f":"IFERROR(IF(M440=\"No\",INDEX(IndexMatch!C:C,MATCH(1,(IndexMatch!A:A=VLOOKUP(H440,'Drop Down'!K:L,2,0))*(IndexMatch!B:B=L440),0)),\"Service Already Opened\"),\"N/A\")","v":"Service Already Opened"},0,{"$f":"IF(O440>VLOOKUP(L440,'Drop Down'!$A$3:$B$10,2,0),\"1\",\"0\")","v":"0"},0,{"$f":"SUM(Table1[[#This Row],[Case Aide Hours]],Table1[[#This Row],[Case Aide Travel Time]])","v":0},{"$f":"IFERROR(IF(OR(Table1[[#This Row],[Child Support Level]]=\"Support Services Lvl 1\", Table1[[#This Row],[Child Support Level]]=\"Support Services Lvl 2\",Table1[[#This Row],[Child Support Level]]=\"Select\"),\"Case Aid Not Allowed\", PRODUCT(Table1[[#This Row],[Total Case Aide]],VLOOKUP(Table1[[#This Row],[County Where Youth Resides]],'Drop Down'!K:M,3,0))),\"0\")","v":"Case Aid Not Allowed"},"No",0,0]
["Select","-","-","-","-","DD/MM/YYYY","DD/MM/YYYY","Select","Select",{"$f":"VLOOKUP(Table1[[#This Row],[DCYF Case Region]],'Drop Down'!$F$3:$G$9,2,0)","v":"Select"},"Select","Select","Select",{"$f":"IFERROR(IF(M441=\"No\",INDEX(IndexMatch!C:C,MATCH(1,(IndexMatch!A:A=VLOOKUP(H441,'Drop Down'!K:L,2,0))*(IndexMatch!B:B=L441),0)),\"Service Already Opened\"),\"N/A\")","v":"Service Already Opened"},0,{"$f":"IF(O441>VLOOKUP(L441,'Drop Down'!$A$3:$B$10,2,0),\"1\",\"0\")","v":"0"},0,{"$f":"SUM(Table1[[#This Row],[Case Aide Hours]],Table1[[#This Row],[Case Aide Travel Time]])","v":0},{"$f":"IFERROR(IF(OR(Table1[[#This Row],[Child Support Level]]=\"Support Services Lvl 1\", Table1[[#This Row],[Child Support Level]]=\"Support Services Lvl 2\",Table1[[#This Row],[Child Support Level]]=\"Select\"),\"Case Aid Not Allowed\", PRODUCT(Table1[[#This Row],[Total Case Aide]],VLOOKUP(Table1[[#This Row],[County Where Youth Resides]],'Drop Down'!K:M,3,0))),\"0\")","v":"Case Aid Not Allowed"},"No",0,0]
["Select","-","-","-","-","DD/MM/YYYY","DD/MM/YYYY","Select","Select",{"$f":"VLOOKUP(Table1[[#This Row],[DCYF Case Region]],'Drop Down'!$F$3:$G$9,2,0)","v":"Select"},"Select","Select","Select",{"$f":"IFERROR(IF(M442=\"No\",INDEX(IndexMatch!C:C,MATCH(1,(IndexMatch!A:A=VLOOKUP(H442,'Drop Down'!K:L,2,0))*(IndexMatch!B:B=L442),0)),\"Service Already Opened\"),\"N/A\")","v":"Service Already Opened"},0,{"$f":"IF(O442>VLOOKUP(L442,'Drop Down'!$A$3:$B$10,2,0),\"1\",\"0\")","v":"0"},0,{"$f":"SUM(Table1[[#This Row],[Case Aide Hours]],Table1[[#This Row],[Case Aide Travel Time]])","v":0},{"$f":"IFERROR(IF(OR(Table1[[#This Row],[Child Support Level]]=\"Support Services Lvl 1\", Table1[[#This Row],[Child Support Level]]=\"Support Services Lvl 2\",Table1[[#This Row],[Child Support Level]]=\"Select\"),\"Case Aid Not Allowed\", PRODUCT(Table1[[#This Row],[Total Case Aide]],VLOOKUP(Table1[[#This Row],[County Where Youth Resides]],'Drop Down'!K:M,3,0))),\"0\")","v":"Case Aid Not Allowed"},"No",0,0]
["Select","-","-","-","-","DD/MM/YYYY","DD/MM/YYYY","Select","Select",{"$f":"VLOOKUP(Table1[[#This Row],[DCYF Case Region]],'Drop Down'!$F$3:$G$9,2,0)","v":"Select"},"Select","Select","Select",{"$f":"IFERROR(IF(M443=\"No\",INDEX(IndexMatch!C:C,MATCH(1,(IndexMatch!A:A=VLOOKUP(H443,'Drop Down'!K:L,2,0))*(IndexMatch!B:B=L443),0)),\"Service Already Opened\"),\"N/A\")","v":"Service Already Opened"},0,{"$f":"IF(O443>VLOOKUP(L443,'Drop Down'!$A$3:$B$10,2,0),\"1\",\"0\")","v":"0"},0,{"$f":"SUM(Table1[[#This Row],[Case Aide Hours]],Table1[[#This Row],[Case Aide Travel Time]])","v":0},{"$f":"IFERROR(IF(OR(Table1[[#This Row],[Child Support Level]]=\"Support Services Lvl 1\", Table1[[#This Row],[Child Support Level]]=\"Support Services Lvl 2\",Table1[[#This Row],[Child Support Level]]=\"Select\"),\"Case Aid Not Allowed\", PRODUCT(Table1[[#This Row],[Total Case Aide]],VLOOKUP(Table1[[#This Row],[County Where Youth Resides]],'Drop Down'!K:M,3,0))),\"0\")","v":"Case Aid Not Allowed"},"No",0,0]
["Select","-","-","-","-","DD/MM/YYYY","DD/MM/YYYY","Select","Select",{"$f":"VLOOKUP(Table1[[#This Row],[DCYF Case Region]],'Drop Down'!$F$3:$G$9,2,0)","v":"Select"},"Select","Select","Select",{"$f":"IFERROR(IF(M444=\"No\",INDEX(IndexMatch!C:C,MATCH(1,(IndexMatch!A:A=VLOOKUP(H444,'Drop Down'!K:L,2,0))*(IndexMatch!B:B=L444),0)),\"Service Already Opened\"),\"N/A\")","v":"Service Already Opened"},0,{"$f":"IF(O444>VLOOKUP(L444,'Drop Down'!$A$3:$B$10,2,0),\"1\",\"0\")","v":"0"},0,{"$f":"SUM(Table1[[#This Row],[Case Aide Hours]],Table1[[#This Row],[Case Aide Travel Time]])","v":0},{"$f":"IFERROR(IF(OR(Table1[[#This Row],[Child Support Level]]=\"Support Services Lvl 1\", Table1[[#This Row],[Child Support Level]]=\"Support Services Lvl 2\",Table1[[#This Row],[Child Support Level]]=\"Select\"),\"Case Aid Not Allowed\", PRODUCT(Table1[[#This Row],[Total Case Aide]],VLOOKUP(Table1[[#This Row],[County Where Youth Resides]],'Drop Down'!K:M,3,0))),\"0\")","v":"Case Aid Not Allowed"},"No",0,0]
["Select","-","-","-","-","DD/MM/YYYY","DD/MM/YYYY","Select","Select",{"$f":"VLOOKUP(Table1[[#This Row],[DCYF Case Region]],'Drop Down'!$F$3:$G$9,2,0)","v":"Select"},"Select","Select","Select",{"$f":"IFERROR(IF(M445=\"No\",INDEX(IndexMatch!C:C,MATCH(1,(IndexMatch!A:A=VLOOKUP(H445,'Drop Down'!K:L,2,0))*(IndexMatch!B:B=L445),0)),\"Service Already Opened\"),\"N/A\")","v":"Service Already Opened"},0,{"$f":"IF(O445>VLOOKUP(L445,'Drop Down'!$A$3:$B$10,2,0),\"1\",\"0\")","v":"0"},0,{"$f":"SUM(Table1[[#This Row],[Case Aide Hours]],Table1[[#This Row],[Case Aide Travel Time]])","v":0},{"$f":"IFERROR(IF(OR(Table1[[#This Row],[Child Support Level]]=\"Support Services Lvl 1\", Table1[[#This Row],[Child Support Level]]=\"Support Services Lvl 2\",Table1[[#This Row],[Child Support Level]]=\"Select\"),\"Case Aid Not Allowed\", PRODUCT(Table1[[#This Row],[Total Case Aide]],VLOOKUP(Table1[[#This Row],[County Where Youth Resides]],'Drop Down'!K:M,3,0))),\"0\")","v":"Case Aid Not Allowed"},"No",0,0]
["Select","-","-","-","-","DD/MM/YYYY","DD/MM/YYYY","Select","Select",{"$f":"VLOOKUP(Table1[[#This Row],[DCYF Case Region]],'Drop Down'!$F$3:$G$9,2,0)","v":"Select"},"Select","Select","Select",{"$f":"IFERROR(IF(M446=\"No\",INDEX(IndexMatch!C:C,MATCH(1,(IndexMatch!A:A=VLOOKUP(H446,'Drop Down'!K:L,2,0))*(IndexMatch!B:B=L446),0)),\"Service Already Opened\"),\"N/A\")","v":"Service Already Opened"},0,{"$f":"IF(O446>VLOOKUP(L446,'Drop Down'!$A$3:$B$10,2,0),\"1\",\"0\")","v":"0"},0,{"$f":"SUM(Table1[[#This Row],[Case Aide Hours]],Table1[[#This Row],[Case Aide Travel Time]])","v":0},{"$f":"IFERROR(IF(OR(Table1[[#This Row],[Child Support Level]]=\"Support Services Lvl 1\", Table1[[#This Row],[Child Support Level]]=\"Support Services Lvl 2\",Table1[[#This Row],[Child Support Level]]=\"Select\"),\"Case Aid Not Allowed\", PRODUCT(Table1[[#This Row],[Total Case Aide]],VLOOKUP(Table1[[#This Row],[County Where Youth Resides]],'Drop Down'!K:M,3,0))),\"0\")","v":"Case Aid Not Allowed"},"No",0,0]
["Select","-","-","-","-","DD/MM/YYYY","DD/MM/YYYY","Select","Select",{"$f":"VLOOKUP(Table1[[#This Row],[DCYF Case Region]],'Drop Down'!$F$3:$G$9,2,0)","v":"Select"},"Select","Select","Select",{"$f":"IFERROR(IF(M447=\"No\",INDEX(IndexMatch!C:C,MATCH(1,(IndexMatch!A:A=VLOOKUP(H447,'Drop Down'!K:L,2,0))*(IndexMatch!B:B=L447),0)),\"Service Already Opened\"),\"N/A\")","v":"Service Already Opened"},0,{"$f":"IF(O447>VLOOKUP(L447,'Drop Down'!$A$3:$B$10,2,0),\"1\",\"0\")","v":"0"},0,{"$f":"SUM(Table1[[#This Row],[Case Aide Hours]],Table1[[#This Row],[Case Aide Travel Time]])","v":0},{"$f":"IFERROR(IF(OR(Table1[[#This Row],[Child Support Level]]=\"Support Services Lvl 1\", Table1[[#This Row],[Child Support Level]]=\"Support Services Lvl 2\",Table1[[#This Row],[Child Support Level]]=\"Select\"),\"Case Aid Not Allowed\", PRODUCT(Table1[[#This Row],[Total Case Aide]],VLOOKUP(Table1[[#This Row],[County Where Youth Resides]],'Drop Down'!K:M,3,0))),\"0\")","v":"Case Aid Not Allowed"},"No",0,0]
["Select","-","-","-","-","DD/MM/YYYY","DD/MM/YYYY","Select","Select",{"$f":"VLOOKUP(Table1[[#This Row],[DCYF Case Region]],'Drop Down'!$F$3:$G$9,2,0)","v":"Select"},"Select","Select","Select",{"$f":"IFERROR(IF(M448=\"No\",INDEX(IndexMatch!C:C,MATCH(1,(IndexMatch!A:A=VLOOKUP(H448,'Drop Down'!K:L,2,0))*(IndexMatch!B:B=L448),0)),\"Service Already Opened\"),\"N/A\")","v":"Service Already Opened"},0,{"$f":"IF(O448>VLOOKUP(L448,'Drop Down'!$A$3:$B$10,2,0),\"1\",\"0\")","v":"0"},0,{"$f":"SUM(Table1[[#This Row],[Case Aide Hours]],Table1[[#This Row],[Case Aide Travel Time]])","v":0},{"$f":"IFERROR(IF(OR(Table1[[#This Row],[Child Support Level]]=\"Support Services Lvl 1\", Table1[[#This Row],[Child Support Level]]=\"Support Services Lvl 2\",Table1[[#This Row],[Child Support Level]]=\"Select\"),\"Case Aid Not Allowed\", PRODUCT(Table1[[#This Row],[Total Case Aide]],VLOOKUP(Table1[[#This Row],[County Where Youth Resides]],'Drop Down'!K:M,3,0))),\"0\")","v":"Case Aid Not Allowed"},"No",0,0]
["Select","-","-","-","-","DD/MM/YYYY","DD/MM/YYYY","Select","Select",{"$f":"VLOOKUP(Table1[[#This Row],[DCYF Case Region]],'Drop Down'!$F$3:$G$9,2,0)","v":"Select"},"Select","Select","Select",{"$f":"IFERROR(IF(M449=\"No\",INDEX(IndexMatch!C:C,MATCH(1,(IndexMatch!A:A=VLOOKUP(H449,'Drop Down'!K:L,2,0))*(IndexMatch!B:B=L449),0)),\"Service Already Opened\"),\"N/A\")","v":"Service Already Opened"},0,{"$f":"IF(O449>VLOOKUP(L449,'Drop Down'!$A$3:$B$10,2,0),\"1\",\"0\")","v":"0"},0,{"$f":"SUM(Table1[[#This Row],[Case Aide Hours]],Table1[[#This Row],[Case Aide Travel Time]])","v":0},{"$f":"IFERROR(IF(OR(Table1[[#This Row],[Child Support Level]]=\"Support Services Lvl 1\", Table1[[#This Row],[Child Support Level]]=\"Support Services Lvl 2\",Table1[[#This Row],[Child Support Level]]=\"Select\"),\"Case Aid Not Allowed\", PRODUCT(Table1[[#This Row],[Total Case Aide]],VLOOKUP(Table1[[#This Row],[County Where Youth Resides]],'Drop Down'!K:M,3,0))),\"0\")","v":"Case Aid Not Allowed"},"No",0,0]
["Select","-","-","-","-","DD/MM/YYYY","DD/MM/YYYY","Select","Select",{"$f":"VLOOKUP(Table1[[#This Row],[DCYF Case Region]],'Drop Down'!$F$3:$G$9,2,0)","v":"Select"},"Select","Select","Select",{"$f":"IFERROR(IF(M450=\"No\",INDEX(IndexMatch!C:C,MATCH(1,(IndexMatch!A:A=VLOOKUP(H450,'Drop Down'!K:L,2,0))*(IndexMatch!B:B=L450),0)),\"Service Already Opened\"),\"N/A\")","v":"Service Already Opened"},0,{"$f":"IF(O450>VLOOKUP(L450,'Drop Down'!$A$3:$B$10,2,0),\"1\",\"0\")","v":"0"},0,{"$f":"SUM(Table1[[#This Row],[Case Aide Hours]],Table1[[#This Row],[Case Aide Travel Time]])","v":0},{"$f":"IFERROR(IF(OR(Table1[[#This Row],[Child Support Level]]=\"Support Services Lvl 1\", Table1[[#This Row],[Child Support Level]]=\"Support Services Lvl 2\",Table1[[#This Row],[Child Support Level]]=\"Select\"),\"Case Aid Not Allowed\", PRODUCT(Table1[[#This Row],[Total Case Aide]],VLOOKUP(Table1[[#This Row],[County Where Youth Resides]],'Drop Down'!K:M,3,0))),\"0\")","v":"Case Aid Not Allowed"},"No",0,{"$f":"ROUND(PRODUCT(U450,0.67),2)","v":0}]
["Select","-","-","-","-","DD/MM/YYYY","DD/MM/YYYY","Select","Select",{"$f":"VLOOKUP(Table1[[#This Row],[DCYF Case Region]],'Drop Down'!$F$3:$G$9,2,0)","v":"Select"},"Select","Select","Select",{"$f":"IFERROR(IF(M451=\"No\",INDEX(IndexMatch!C:C,MATCH(1,(IndexMatch!A:A=VLOOKUP(H451,'Drop Down'!K:L,2,0))*(IndexMatch!B:B=L451),0)),\"Service Already Opened\"),\"N/A\")","v":"Service Already Opened"},0,{"$f":"IF(O451>VLOOKUP(L451,'Drop Down'!$A$3:$B$10,2,0),\"1\",\"0\")","v":"0"},0,{"$f":"SUM(Table1[[#This Row],[Case Aide Hours]],Table1[[#This Row],[Case Aide Travel Time]])","v":0},{"$f":"IFERROR(IF(OR(Table1[[#This Row],[Child Support Level]]=\"Support Services Lvl 1\", Table1[[#This Row],[Child Support Level]]=\"Support Services Lvl 2\",Table1[[#This Row],[Child Support Level]]=\"Select\"),\"Case Aid Not Allowed\", PRODUCT(Table1[[#This Row],[Total Case Aide]],VLOOKUP(Table1[[#This Row],[County Where Youth Resides]],'Drop Down'!K:M,3,0))),\"0\")","v":"Case Aid Not Allowed"},{"$f":"IF(P451=\"1\",\"Yes\",\"No\")","v":"No"},0,0]
["Select","-","-","-","-","DD/MM/YYYY","DD/MM/YYYY","Select","Select",{"$f":"VLOOKUP(Table1[[#This Row],[DCYF Case Region]],'Drop Down'!$F$3:$G$9,2,0)","v":"Select"},"Select","Select","Select",{"$f":"IFERROR(IF(M452=\"No\",INDEX(IndexMatch!C:C,MATCH(1,(IndexMatch!A:A=VLOOKUP(H452,'Drop Down'!K:L,2,0))*(IndexMatch!B:B=L452),0)),\"Service Already Opened\"),\"N/A\")","v":"Service Already Opened"},0,{"$f":"IF(O452>VLOOKUP(L452,'Drop Down'!$A$3:$B$10,2,0),\"1\",\"0\")","v":"0"},0,{"$f":"SUM(Table1[[#This Row],[Case Aide Hours]],Table1[[#This Row],[Case Aide Travel Time]])","v":0},{"$f":"IFERROR(IF(OR(Table1[[#This Row],[Child Support Level]]=\"Support Services Lvl 1\", Table1[[#This Row],[Child Support Level]]=\"Support Services Lvl 2\",Table1[[#This Row],[Child Support Level]]=\"Select\"),\"Case Aid Not Allowed\", PRODUCT(Table1[[#This Row],[Total Case Aide]],VLOOKUP(Table1[[#This Row],[County Where Youth Resides]],'Drop Down'!K:M,3,0))),\"0\")","v":"Case Aid Not Allowed"},"No",0,0]
["Select","-","-","-","-","DD/MM/YYYY","DD/MM/YYYY","Select","Select",{"$f":"VLOOKUP(Table1[[#This Row],[DCYF Case Region]],'Drop Down'!$F$3:$G$9,2,0)","v":"Select"},"Select","Select","Select",{"$f":"IFERROR(IF(M453=\"No\",INDEX(IndexMatch!C:C,MATCH(1,(IndexMatch!A:A=VLOOKUP(H453,'Drop Down'!K:L,2,0))*(IndexMatch!B:B=L453),0)),\"Service Already Opened\"),\"N/A\")","v":"Service Already Opened"},0,{"$f":"IF(O453>VLOOKUP(L453,'Drop Down'!$A$3:$B$10,2,0),\"1\",\"0\")","v":"0"},0,{"$f":"SUM(Table1[[#This Row],[Case Aide Hours]],Table1[[#This Row],[Case Aide Travel Time]])","v":0},{"$f":"IFERROR(IF(OR(Table1[[#This Row],[Child Support Level]]=\"Support Services Lvl 1\", Table1[[#This Row],[Child Support Level]]=\"Support Services Lvl 2\",Table1[[#This Row],[Child Support Level]]=\"Select\"),\"Case Aid Not Allowed\", PRODUCT(Table1[[#This Row],[Total Case Aide]],VLOOKUP(Table1[[#This Row],[County Where Youth Resides]],'Drop Down'!K:M,3,0))),\"0\")","v":"Case Aid Not Allowed"},"No",0,0]
["Select","-","-","-","-","DD/MM/YYYY","DD/MM/YYYY","Select","Select",{"$f":"VLOOKUP(Table1[[#This Row],[DCYF Case Region]],'Drop Down'!$F$3:$G$9,2,0)","v":"Select"},"Select","Select","Select",{"$f":"IFERROR(IF(M454=\"No\",INDEX(IndexMatch!C:C,MATCH(1,(IndexMatch!A:A=VLOOKUP(H454,'Drop Down'!K:L,2,0))*(IndexMatch!B:B=L454),0)),\"Service Already Opened\"),\"N/A\")","v":"Service Already Opened"},0,{"$f":"IF(O454>VLOOKUP(L454,'Drop Down'!$A$3:$B$10,2,0),\"1\",\"0\")","v":"0"},0,{"$f":"SUM(Table1[[#This Row],[Case Aide Hours]],Table1[[#This Row],[Case Aide Travel Time]])","v":0},{"$f":"IFERROR(IF(OR(Table1[[#This Row],[Child Support Level]]=\"Support Services Lvl 1\", Table1[[#This Row],[Child Support Level]]=\"Support Services Lvl 2\",Table1[[#This Row],[Child Support Level]]=\"Select\"),\"Case Aid Not Allowed\", PRODUCT(Table1[[#This Row],[Total Case Aide]],VLOOKUP(Table1[[#This Row],[County Where Youth Resides]],'Drop Down'!K:M,3,0))),\"0\")","v":"Case Aid Not Allowed"},"No",0,0]
["Select","-","-","-","-","DD/MM/YYYY","DD/MM/YYYY","Select","Select",{"$f":"VLOOKUP(Table1[[#This Row],[DCYF Case Region]],'Drop Down'!$F$3:$G$9,2,0)","v":"Select"},"Select","Select","Select",{"$f":"IFERROR(IF(M455=\"No\",INDEX(IndexMatch!C:C,MATCH(1,(IndexMatch!A:A=VLOOKUP(H455,'Drop Down'!K:L,2,0))*(IndexMatch!B:B=L455),0)),\"Service Already Opened\"),\"N/A\")","v":"Service Already Opened"},0,{"$f":"IF(O455>VLOOKUP(L455,'Drop Down'!$A$3:$B$10,2,0),\"1\",\"0\")","v":"0"},0,{"$f":"SUM(Table1[[#This Row],[Case Aide Hours]],Table1[[#This Row],[Case Aide Travel Time]])","v":0},{"$f":"IFERROR(IF(OR(Table1[[#This Row],[Child Support Level]]=\"Support Services Lvl 1\", Table1[[#This Row],[Child Support Level]]=\"Support Services Lvl 2\",Table1[[#This Row],[Child Support Level]]=\"Select\"),\"Case Aid Not Allowed\", PRODUCT(Table1[[#This Row],[Total Case Aide]],VLOOKUP(Table1[[#This Row],[County Where Youth Resides]],'Drop Down'!K:M,3,0))),\"0\")","v":"Case Aid Not Allowed"},"No",0,0]
["Select","-","-","-","-","DD/MM/YYYY","DD/MM/YYYY","Select","Select",{"$f":"VLOOKUP(Table1[[#This Row],[DCYF Case Region]],'Drop Down'!$F$3:$G$9,2,0)","v":"Select"},"Select","Select","Select",{"$f":"IFERROR(IF(M456=\"No\",INDEX(IndexMatch!C:C,MATCH(1,(IndexMatch!A:A=VLOOKUP(H456,'Drop Down'!K:L,2,0))*(IndexMatch!B:B=L456),0)),\"Service Already Opened\"),\"N/A\")","v":"Service Already Opened"},0,{"$f":"IF(O456>VLOOKUP(L456,'Drop Down'!$A$3:$B$10,2,0),\"1\",\"0\")","v":"0"},0,{"$f":"SUM(Table1[[#This Row],[Case Aide Hours]],Table1[[#This Row],[Case Aide Travel Time]])","v":0},{"$f":"IFERROR(IF(OR(Table1[[#This Row],[Child Support Level]]=\"Support Services Lvl 1\", Table1[[#This Row],[Child Support Level]]=\"Support Services Lvl 2\",Table1[[#This Row],[Child Support Level]]=\"Select\"),\"Case Aid Not Allowed\", PRODUCT(Table1[[#This Row],[Total Case Aide]],VLOOKUP(Table1[[#This Row],[County Where Youth Resides]],'Drop Down'!K:M,3,0))),\"0\")","v":"Case Aid Not Allowed"},"No",0,0]
["Select","-","-","-","-","DD/MM/YYYY","DD/MM/YYYY","Select","Select",{"$f":"VLOOKUP(Table1[[#This Row],[DCYF Case Region]],'Drop Down'!$F$3:$G$9,2,0)","v":"Select"},"Select","Select","Select",{"$f":"IFERROR(IF(M457=\"No\",INDEX(IndexMatch!C:C,MATCH(1,(IndexMatch!A:A=VLOOKUP(H457,'Drop Down'!K:L,2,0))*(IndexMatch!B:B=L457),0)),\"Service Already Opened\"),\"N/A\")","v":"Service Already Opened"},0,{"$f":"IF(O457>VLOOKUP(L457,'Drop Down'!$A$3:$B$10,2,0),\"1\",\"0\")","v":"0"},0,{"$f":"SUM(Table1[[#This Row],[Case Aide Hours]],Table1[[#This Row],[Case Aide Travel Time]])","v":0},{"$f":"IFERROR(IF(OR(Table1[[#This Row],[Child Support Level]]=\"Support Services Lvl 1\", Table1[[#This Row],[Child Support Level]]=\"Support Services Lvl 2\",Table1[[#This Row],[Child Support Level]]=\"Select\"),\"Case Aid Not Allowed\", PRODUCT(Table1[[#This Row],[Total Case Aide]],VLOOKUP(Table1[[#This Row],[County Where Youth Resides]],'Drop Down'!K:M,3,0))),\"0\")","v":"Case Aid Not Allowed"},"No",0,0]
["Select","-","-","-","-","DD/MM/YYYY","DD/MM/YYYY","Select","Select",{"$f":"VLOOKUP(Table1[[#This Row],[DCYF Case Region]],'Drop Down'!$F$3:$G$9,2,0)","v":"Select"},"Select","Select","Select",{"$f":"IFERROR(IF(M458=\"No\",INDEX(IndexMatch!C:C,MATCH(1,(IndexMatch!A:A=VLOOKUP(H458,'Drop Down'!K:L,2,0))*(IndexMatch!B:B=L458),0)),\"Service Already Opened\"),\"N/A\")","v":"Service Already Opened"},0,{"$f":"IF(O458>VLOOKUP(L458,'Drop Down'!$A$3:$B$10,2,0),\"1\",\"0\")","v":"0"},0,{"$f":"SUM(Table1[[#This Row],[Case Aide Hours]],Table1[[#This Row],[Case Aide Travel Time]])","v":0},{"$f":"IFERROR(IF(OR(Table1[[#This Row],[Child Support Level]]=\"Support Services Lvl 1\", Table1[[#This Row],[Child Support Level]]=\"Support Services Lvl 2\",Table1[[#This Row],[Child Support Level]]=\"Select\"),\"Case Aid Not Allowed\", PRODUCT(Table1[[#This Row],[Total Case Aide]],VLOOKUP(Table1[[#This Row],[County Where Youth Resides]],'Drop Down'!K:M,3,0))),\"0\")","v":"Case Aid Not Allowed"},"No",0,0]
["Select","-","-","-","-","DD/MM/YYYY","DD/MM/YYYY","Select","Select",{"$f":"VLOOKUP(Table1[[#This Row],[DCYF Case Region]],'Drop Down'!$F$3:$G$9,2,0)","v":"Select"},"Select","Select","Select",{"$f":"IFERROR(IF(M459=\"No\",INDEX(IndexMatch!C:C,MATCH(1,(IndexMatch!A:A=VLOOKUP(H459,'Drop Down'!K:L,2,0))*(IndexMatch!B:B=L459),0)),\"Service Already Opened\"),\"N/A\")","v":"Service Already Opened"},0,{"$f":"IF(O459>VLOOKUP(L459,'Drop Down'!$A$3:$B$10,2,0),\"1\",\"0\")","v":"0"},0,{"$f":"SUM(Table1[[#This Row],[Case Aide Hours]],Table1[[#This Row],[Case Aide Travel Time]])","v":0},{"$f":"IFERROR(IF(OR(Table1[[#This Row],[Child Support Level]]=\"Support Services Lvl 1\", Table1[[#This Row],[Child Support Level]]=\"Support Services Lvl 2\",Table1[[#This Row],[Child Support Level]]=\"Select\"),\"Case Aid Not Allowed\", PRODUCT(Table1[[#This Row],[Total Case Aide]],VLOOKUP(Table1[[#This Row],[County Where Youth Resides]],'Drop Down'!K:M,3,0))),\"0\")","v":"Case Aid Not Allowed"},"No",0,0]
["Select","-","-","-","-","DD/MM/YYYY","DD/MM/YYYY","Select","Select",{"$f":"VLOOKUP(Table1[[#This Row],[DCYF Case Region]],'Drop Down'!$F$3:$G$9,2,0)","v":"Select"},"Select","Select","Select",{"$f":"IFERROR(IF(M460=\"No\",INDEX(IndexMatch!C:C,MATCH(1,(IndexMatch!A:A=VLOOKUP(H460,'Drop Down'!K:L,2,0))*(IndexMatch!B:B=L460),0)),\"Service Already Opened\"),\"N/A\")","v":"Service Already Opened"},0,{"$f":"IF(O460>VLOOKUP(L460,'Drop Down'!$A$3:$B$10,2,0),\"1\",\"0\")","v":"0"},0,{"$f":"SUM(Table1[[#This Row],[Case Aide Hours]],Table1[[#This Row],[Case Aide Travel Time]])","v":0},{"$f":"IFERROR(IF(OR(Table1[[#This Row],[Child Support Level]]=\"Support Services Lvl 1\", Table1[[#This Row],[Child Support Level]]=\"Support Services Lvl 2\",Table1[[#This Row],[Child Support Level]]=\"Select\"),\"Case Aid Not Allowed\", PRODUCT(Table1[[#This Row],[Total Case Aide]],VLOOKUP(Table1[[#This Row],[County Where Youth Resides]],'Drop Down'!K:M,3,0))),\"0\")","v":"Case Aid Not Allowed"},"No",0,0]
["Select","-","-","-","-","DD/MM/YYYY","DD/MM/YYYY","Select","Select",{"$f":"VLOOKUP(Table1[[#This Row],[DCYF Case Region]],'Drop Down'!$F$3:$G$9,2,0)","v":"Select"},"Select","Select","Select",{"$f":"IFERROR(IF(M461=\"No\",INDEX(IndexMatch!C:C,MATCH(1,(IndexMatch!A:A=VLOOKUP(H461,'Drop Down'!K:L,2,0))*(IndexMatch!B:B=L461),0)),\"Service Already Opened\"),\"N/A\")","v":"Service Already Opened"},0,{"$f":"IF(O461>VLOOKUP(L461,'Drop Down'!$A$3:$B$10,2,0),\"1\",\"0\")","v":"0"},0,{"$f":"SUM(Table1[[#This Row],[Case Aide Hours]],Table1[[#This Row],[Case Aide Travel Time]])","v":0},{"$f":"IFERROR(IF(OR(Table1[[#This Row],[Child Support Level]]=\"Support Services Lvl 1\", Table1[[#This Row],[Child Support Level]]=\"Support Services Lvl 2\",Table1[[#This Row],[Child Support Level]]=\"Select\"),\"Case Aid Not Allowed\", PRODUCT(Table1[[#This Row],[Total Case Aide]],VLOOKUP(Table1[[#This Row],[County Where Youth Resides]],'Drop Down'!K:M,3,0))),\"0\")","v":"Case Aid Not Allowed"},"No",0,0]
["Select","-","-","-","-","DD/MM/YYYY","DD/MM/YYYY","Select","Select",{"$f":"VLOOKUP(Table1[[#This Row],[DCYF Case Region]],'Drop Down'!$F$3:$G$9,2,0)","v":"Select"},"Select","Select","Select",{"$f":"IFERROR(IF(M462=\"No\",INDEX(IndexMatch!C:C,MATCH(1,(IndexMatch!A:A=VLOOKUP(H462,'Drop Down'!K:L,2,0))*(IndexMatch!B:B=L462),0)),\"Service Already Opened\"),\"N/A\")","v":"Service Already Opened"},0,{"$f":"IF(O462>VLOOKUP(L462,'Drop Down'!$A$3:$B$10,2,0),\"1\",\"0\")","v":"0"},0,{"$f":"SUM(Table1[[#This Row],[Case Aide Hours]],Table1[[#This Row],[Case Aide Travel Time]])","v":0},{"$f":"IFERROR(IF(OR(Table1[[#This Row],[Child Support Level]]=\"Support Services Lvl 1\", Table1[[#This Row],[Child Support Level]]=\"Support Services Lvl 2\",Table1[[#This Row],[Child Support Level]]=\"Select\"),\"Case Aid Not Allowed\", PRODUCT(Table1[[#This Row],[Total Case Aide]],VLOOKUP(Table1[[#This Row],[County Where Youth Resides]],'Drop Down'!K:M,3,0))),\"0\")","v":"Case Aid Not Allowed"},"No",0,0]
["Select","-","-","-","-","DD/MM/YYYY","DD/MM/YYYY","Select","Select",{"$f":"VLOOKUP(Table1[[#This Row],[DCYF Case Region]],'Drop Down'!$F$3:$G$9,2,0)","v":"Select"},"Select","Select","Select",{"$f":"IFERROR(IF(M463=\"No\",INDEX(IndexMatch!C:C,MATCH(1,(IndexMatch!A:A=VLOOKUP(H463,'Drop Down'!K:L,2,0))*(IndexMatch!B:B=L463),0)),\"Service Already Opened\"),\"N/A\")","v":"Service Already Opened"},0,{"$f":"IF(O463>VLOOKUP(L463,'Drop Down'!$A$3:$B$10,2,0),\"1\",\"0\")","v":"0"},0,{"$f":"SUM(Table1[[#This Row],[Case Aide Hours]],Table1[[#This Row],[Case Aide Travel Time]])","v":0},{"$f":"IFERROR(IF(OR(Table1[[#This Row],[Child Support Level]]=\"Support Services Lvl 1\", Table1[[#This Row],[Child Support Level]]=\"Support Services Lvl 2\",Table1[[#This Row],[Child Support Level]]=\"Select\"),\"Case Aid Not Allowed\", PRODUCT(Table1[[#This Row],[Total Case Aide]],VLOOKUP(Table1[[#This Row],[County Where Youth Resides]],'Drop Down'!K:M,3,0))),\"0\")","v":"Case Aid Not Allowed"},"No",0,0]
["Select","-","-","-","-","DD/MM/YYYY","DD/MM/YYYY","Select","Select",{"$f":"VLOOKUP(Table1[[#This Row],[DCYF Case Region]],'Drop Down'!$F$3:$G$9,2,0)","v":"Select"},"Select","Select","Select",{"$f":"IFERROR(IF(M464=\"No\",INDEX(IndexMatch!C:C,MATCH(1,(IndexMatch!A:A=VLOOKUP(H464,'Drop Down'!K:L,2,0))*(IndexMatch!B:B=L464),0)),\"Service Already Opened\"),\"N/A\")","v":"Service Already Opened"},0,{"$f":"IF(O464>VLOOKUP(L464,'Drop Down'!$A$3:$B$10,2,0),\"1\",\"0\")","v":"0"},0,{"$f":"SUM(Table1[[#This Row],[Case Aide Hours]],Table1[[#This Row],[Case Aide Travel Time]])","v":0},{"$f":"IFERROR(IF(OR(Table1[[#This Row],[Child Support Level]]=\"Support Services Lvl 1\", Table1[[#This Row],[Child Support Level]]=\"Support Services Lvl 2\",Table1[[#This Row],[Child Support Level]]=\"Select\"),\"Case Aid Not Allowed\", PRODUCT(Table1[[#This Row],[Total Case Aide]],VLOOKUP(Table1[[#This Row],[County Where Youth Resides]],'Drop Down'!K:M,3,0))),\"0\")","v":"Case Aid Not Allowed"},"No",0,0]
["Select","-","-","-","-","DD/MM/YYYY","DD/MM/YYYY","Select","Select",{"$f":"VLOOKUP(Table1[[#This Row],[DCYF Case Region]],'Drop Down'!$F$3:$G$9,2,0)","v":"Select"},"Select","Select","Select",{"$f":"IFERROR(IF(M465=\"No\",INDEX(IndexMatch!C:C,MATCH(1,(IndexMatch!A:A=VLOOKUP(H465,'Drop Down'!K:L,2,0))*(IndexMatch!B:B=L465),0)),\"Service Already Opened\"),\"N/A\")","v":"Service Already Opened"},0,{"$f":"IF(O465>VLOOKUP(L465,'Drop Down'!$A$3:$B$10,2,0),\"1\",\"0\")","v":"0"},0,{"$f":"SUM(Table1[[#This Row],[Case Aide Hours]],Table1[[#This Row],[Case Aide Travel Time]])","v":0},{"$f":"IFERROR(IF(OR(Table1[[#This Row],[Child Support Level]]=\"Support Services Lvl 1\", Table1[[#This Row],[Child Support Level]]=\"Support Services Lvl 2\",Table1[[#This Row],[Child Support Level]]=\"Select\"),\"Case Aid Not Allowed\", PRODUCT(Table1[[#This Row],[Total Case Aide]],VLOOKUP(Table1[[#This Row],[County Where Youth Resides]],'Drop Down'!K:M,3,0))),\"0\")","v":"Case Aid Not Allowed"},"No",0,0]
["Select","-","-","-","-","DD/MM/YYYY","DD/MM/YYYY","Select","Select",{"$f":"VLOOKUP(Table1[[#This Row],[DCYF Case Region]],'Drop Down'!$F$3:$G$9,2,0)","v":"Select"},"Select","Select","Select",{"$f":"IFERROR(IF(M466=\"No\",INDEX(IndexMatch!C:C,MATCH(1,(IndexMatch!A:A=VLOOKUP(H466,'Drop Down'!K:L,2,0))*(IndexMatch!B:B=L466),0)),\"Service Already Opened\"),\"N/A\")","v":"Service Already Opened"},0,{"$f":"IF(O466>VLOOKUP(L466,'Drop Down'!$A$3:$B$10,2,0),\"1\",\"0\")","v":"0"},0,{"$f":"SUM(Table1[[#This Row],[Case Aide Hours]],Table1[[#This Row],[Case Aide Travel Time]])","v":0},{"$f":"IFERROR(IF(OR(Table1[[#This Row],[Child Support Level]]=\"Support Services Lvl 1\", Table1[[#This Row],[Child Support Level]]=\"Support Services Lvl 2\",Table1[[#This Row],[Child Support Level]]=\"Select\"),\"Case Aid Not Allowed\", PRODUCT(Table1[[#This Row],[Total Case Aide]],VLOOKUP(Table1[[#This Row],[County Where Youth Resides]],'Drop Down'!K:M,3,0))),\"0\")","v":"Case Aid Not Allowed"},"No",0,0]
["Select","-","-","-","-","DD/MM/YYYY","DD/MM/YYYY","Select","Select",{"$f":"VLOOKUP(Table1[[#This Row],[DCYF Case Region]],'Drop Down'!$F$3:$G$9,2,0)","v":"Select"},"Select","Select","Select",{"$f":"IFERROR(IF(M467=\"No\",INDEX(IndexMatch!C:C,MATCH(1,(IndexMatch!A:A=VLOOKUP(H467,'Drop Down'!K:L,2,0))*(IndexMatch!B:B=L467),0)),\"Service Already Opened\"),\"N/A\")","v":"Service Already Opened"},0,{"$f":"IF(O467>VLOOKUP(L467,'Drop Down'!$A$3:$B$10,2,0),\"1\",\"0\")","v":"0"},0,{"$f":"SUM(Table1[[#This Row],[Case Aide Hours]],Table1[[#This Row],[Case Aide Travel Time]])","v":0},{"$f":"IFERROR(IF(OR(Table1[[#This Row],[Child Support Level]]=\"Support Services Lvl 1\", Table1[[#This Row],[Child Support Level]]=\"Support Services Lvl 2\",Table1[[#This Row],[Child Support Level]]=\"Select\"),\"Case Aid Not Allowed\", PRODUCT(Table1[[#This Row],[Total Case Aide]],VLOOKUP(Table1[[#This Row],[County Where Youth Resides]],'Drop Down'!K:M,3,0))),\"0\")","v":"Case Aid Not Allowed"},"No",0,0]
["Select","-","-","-","-","DD/MM/YYYY","DD/MM/YYYY","Select","Select",{"$f":"VLOOKUP(Table1[[#This Row],[DCYF Case Region]],'Drop Down'!$F$3:$G$9,2,0)","v":"Select"},"Select","Select","Select",{"$f":"IFERROR(IF(M468=\"No\",INDEX(IndexMatch!C:C,MATCH(1,(IndexMatch!A:A=VLOOKUP(H468,'Drop Down'!K:L,2,0))*(IndexMatch!B:B=L468),0)),\"Service Already Opened\"),\"N/A\")","v":"Service Already Opened"},0,{"$f":"IF(O468>VLOOKUP(L468,'Drop Down'!$A$3:$B$10,2,0),\"1\",\"0\")","v":"0"},0,{"$f":"SUM(Table1[[#This Row],[Case Aide Hours]],Table1[[#This Row],[Case Aide Travel Time]])","v":0},{"$f":"IFERROR(IF(OR(Table1[[#This Row],[Child Support Level]]=\"Support Services Lvl 1\", Table1[[#This Row],[Child Support Level]]=\"Support Services Lvl 2\",Table1[[#This Row],[Child Support Level]]=\"Select\"),\"Case Aid Not Allowed\", PRODUCT(Table1[[#This Row],[Total Case Aide]],VLOOKUP(Table1[[#This Row],[County Where Youth Resides]],'Drop Down'!K:M,3,0))),\"0\")","v":"Case Aid Not Allowed"},"No",0,0]
["Select","-","-","-","-","DD/MM/YYYY","DD/MM/YYYY","Select","Select",{"$f":"VLOOKUP(Table1[[#This Row],[DCYF Case Region]],'Drop Down'!$F$3:$G$9,2,0)","v":"Select"},"Select","Select","Select",{"$f":"IFERROR(IF(M469=\"No\",INDEX(IndexMatch!C:C,MATCH(1,(IndexMatch!A:A=VLOOKUP(H469,'Drop Down'!K:L,2,0))*(IndexMatch!B:B=L469),0)),\"Service Already Opened\"),\"N/A\")","v":"Service Already Opened"},0,{"$f":"IF(O469>VLOOKUP(L469,'Drop Down'!$A$3:$B$10,2,0),\"1\",\"0\")","v":"0"},0,{"$f":"SUM(Table1[[#This Row],[Case Aide Hours]],Table1[[#This Row],[Case Aide Travel Time]])","v":0},{"$f":"IFERROR(IF(OR(Table1[[#This Row],[Child Support Level]]=\"Support Services Lvl 1\", Table1[[#This Row],[Child Support Level]]=\"Support Services Lvl 2\",Table1[[#This Row],[Child Support Level]]=\"Select\"),\"Case Aid Not Allowed\", PRODUCT(Table1[[#This Row],[Total Case Aide]],VLOOKUP(Table1[[#This Row],[County Where Youth Resides]],'Drop Down'!K:M,3,0))),\"0\")","v":"Case Aid Not Allowed"},"No",0,0]
["Select","-","-","-","-","DD/MM/YYYY","DD/MM/YYYY","Select","Select",{"$f":"VLOOKUP(Table1[[#This Row],[DCYF Case Region]],'Drop Down'!$F$3:$G$9,2,0)","v":"Select"},"Select","Select","Select",{"$f":"IFERROR(IF(M470=\"No\",INDEX(IndexMatch!C:C,MATCH(1,(IndexMatch!A:A=VLOOKUP(H470,'Drop Down'!K:L,2,0))*(IndexMatch!B:B=L470),0)),\"Service Already Opened\"),\"N/A\")","v":"Service Already Opened"},0,{"$f":"IF(O470>VLOOKUP(L470,'Drop Down'!$A$3:$B$10,2,0),\"1\",\"0\")","v":"0"},0,{"$f":"SUM(Table1[[#This Row],[Case Aide Hours]],Table1[[#This Row],[Case Aide Travel Time]])","v":0},{"$f":"IFERROR(IF(OR(Table1[[#This Row],[Child Support Level]]=\"Support Services Lvl 1\", Table1[[#This Row],[Child Support Level]]=\"Support Services Lvl 2\",Table1[[#This Row],[Child Support Level]]=\"Select\"),\"Case Aid Not Allowed\", PRODUCT(Table1[[#This Row],[Total Case Aide]],VLOOKUP(Table1[[#This Row],[County Where Youth Resides]],'Drop Down'!K:M,3,0))),\"0\")","v":"Case Aid Not Allowed"},"No",0,0]
["Select","-","-","-","-","DD/MM/YYYY","DD/MM/YYYY","Select","Select",{"$f":"VLOOKUP(Table1[[#This Row],[DCYF Case Region]],'Drop Down'!$F$3:$G$9,2,0)","v":"Select"},"Select","Select","Select",{"$f":"IFERROR(IF(M471=\"No\",INDEX(IndexMatch!C:C,MATCH(1,(IndexMatch!A:A=VLOOKUP(H471,'Drop Down'!K:L,2,0))*(IndexMatch!B:B=L471),0)),\"Service Already Opened\"),\"N/A\")","v":"Service Already Opened"},0,{"$f":"IF(O471>VLOOKUP(L471,'Drop Down'!$A$3:$B$10,2,0),\"1\",\"0\")","v":"0"},0,{"$f":"SUM(Table1[[#This Row],[Case Aide Hours]],Table1[[#This Row],[Case Aide Travel Time]])","v":0},{"$f":"IFERROR(IF(OR(Table1[[#This Row],[Child Support Level]]=\"Support Services Lvl 1\", Table1[[#This Row],[Child Support Level]]=\"Support Services Lvl 2\",Table1[[#This Row],[Child Support Level]]=\"Select\"),\"Case Aid Not Allowed\", PRODUCT(Table1[[#This Row],[Total Case Aide]],VLOOKUP(Table1[[#This Row],[County Where Youth Resides]],'Drop Down'!K:M,3,0))),\"0\")","v":"Case Aid Not Allowed"},"No",0,0]
["Select","-","-","-","-","DD/MM/YYYY","DD/MM/YYYY","Select","Select",{"$f":"VLOOKUP(Table1[[#This Row],[DCYF Case Region]],'Drop Down'!$F$3:$G$9,2,0)","v":"Select"},"Select","Select","Select",{"$f":"IFERROR(IF(M472=\"No\",INDEX(IndexMatch!C:C,MATCH(1,(IndexMatch!A:A=VLOOKUP(H472,'Drop Down'!K:L,2,0))*(IndexMatch!B:B=L472),0)),\"Service Already Opened\"),\"N/A\")","v":"Service Already Opened"},0,{"$f":"IF(O472>VLOOKUP(L472,'Drop Down'!$A$3:$B$10,2,0),\"1\",\"0\")","v":"0"},0,{"$f":"SUM(Table1[[#This Row],[Case Aide Hours]],Table1[[#This Row],[Case Aide Travel Time]])","v":0},{"$f":"IFERROR(IF(OR(Table1[[#This Row],[Child Support Level]]=\"Support Services Lvl 1\", Table1[[#This Row],[Child Support Level]]=\"Support Services Lvl 2\",Table1[[#This Row],[Child Support Level]]=\"Select\"),\"Case Aid Not Allowed\", PRODUCT(Table1[[#This Row],[Total Case Aide]],VLOOKUP(Table1[[#This Row],[County Where Youth Resides]],'Drop Down'!K:M,3,0))),\"0\")","v":"Case Aid Not Allowed"},"No",0,0]
["Select","-","-","-","-","DD/MM/YYYY","DD/MM/YYYY","Select","Select",{"$f":"VLOOKUP(Table1[[#This Row],[DCYF Case Region]],'Drop Down'!$F$3:$G$9,2,0)","v":"Select"},"Select","Select","Select",{"$f":"IFERROR(IF(M473=\"No\",INDEX(IndexMatch!C:C,MATCH(1,(IndexMatch!A:A=VLOOKUP(H473,'Drop Down'!K:L,2,0))*(IndexMatch!B:B=L473),0)),\"Service Already Opened\"),\"N/A\")","v":"Service Already Opened"},0,{"$f":"IF(O473>VLOOKUP(L473,'Drop Down'!$A$3:$B$10,2,0),\"1\",\"0\")","v":"0"},0,{"$f":"SUM(Table1[[#This Row],[Case Aide Hours]],Table1[[#This Row],[Case Aide Travel Time]])","v":0},{"$f":"IFERROR(IF(OR(Table1[[#This Row],[Child Support Level]]=\"Support Services Lvl 1\", Table1[[#This Row],[Child Support Level]]=\"Support Services Lvl 2\",Table1[[#This Row],[Child Support Level]]=\"Select\"),\"Case Aid Not Allowed\", PRODUCT(Table1[[#This Row],[Total Case Aide]],VLOOKUP(Table1[[#This Row],[County Where Youth Resides]],'Drop Down'!K:M,3,0))),\"0\")","v":"Case Aid Not Allowed"},"No",0,0]
["Select","-","-","-","-","DD/MM/YYYY","DD/MM/YYYY","Select","Select",{"$f":"VLOOKUP(Table1[[#This Row],[DCYF Case Region]],'Drop Down'!$F$3:$G$9,2,0)","v":"Select"},"Select","Select","Select",{"$f":"IFERROR(IF(M474=\"No\",INDEX(IndexMatch!C:C,MATCH(1,(IndexMatch!A:A=VLOOKUP(H474,'Drop Down'!K:L,2,0))*(IndexMatch!B:B=L474),0)),\"Service Already Opened\"),\"N/A\")","v":"Service Already Opened"},0,{"$f":"IF(O474>VLOOKUP(L474,'Drop Down'!$A$3:$B$10,2,0),\"1\",\"0\")","v":"0"},0,{"$f":"SUM(Table1[[#This Row],[Case Aide Hours]],Table1[[#This Row],[Case Aide Travel Time]])","v":0},{"$f":"IFERROR(IF(OR(Table1[[#This Row],[Child Support Level]]=\"Support Services Lvl 1\", Table1[[#This Row],[Child Support Level]]=\"Support Services Lvl 2\",Table1[[#This Row],[Child Support Level]]=\"Select\"),\"Case Aid Not Allowed\", PRODUCT(Table1[[#This Row],[Total Case Aide]],VLOOKUP(Table1[[#This Row],[County Where Youth Resides]],'Drop Down'!K:M,3,0))),\"0\")","v":"Case Aid Not Allowed"},"No",0,0]
["Select","-","-","-","-","DD/MM/YYYY","DD/MM/YYYY","Select","Select",{"$f":"VLOOKUP(Table1[[#This Row],[DCYF Case Region]],'Drop Down'!$F$3:$G$9,2,0)","v":"Select"},"Select","Select","Select",{"$f":"IFERROR(IF(M475=\"No\",INDEX(IndexMatch!C:C,MATCH(1,(IndexMatch!A:A=VLOOKUP(H475,'Drop Down'!K:L,2,0))*(IndexMatch!B:B=L475),0)),\"Service Already Opened\"),\"N/A\")","v":"Service Already Opened"},0,{"$f":"IF(O475>VLOOKUP(L475,'Drop Down'!$A$3:$B$10,2,0),\"1\",\"0\")","v":"0"},0,{"$f":"SUM(Table1[[#This Row],[Case Aide Hours]],Table1[[#This Row],[Case Aide Travel Time]])","v":0},{"$f":"IFERROR(IF(OR(Table1[[#This Row],[Child Support Level]]=\"Support Services Lvl 1\", Table1[[#This Row],[Child Support Level]]=\"Support Services Lvl 2\",Table1[[#This Row],[Child Support Level]]=\"Select\"),\"Case Aid Not Allowed\", PRODUCT(Table1[[#This Row],[Total Case Aide]],VLOOKUP(Table1[[#This Row],[County Where Youth Resides]],'Drop Down'!K:M,3,0))),\"0\")","v":"Case Aid Not Allowed"},"No",0,0]
["Select","-","-","-","-","DD/MM/YYYY","DD/MM/YYYY","Select","Select",{"$f":"VLOOKUP(Table1[[#This Row],[DCYF Case Region]],'Drop Down'!$F$3:$G$9,2,0)","v":"Select"},"Select","Select","Select",{"$f":"IFERROR(IF(M476=\"No\",INDEX(IndexMatch!C:C,MATCH(1,(IndexMatch!A:A=VLOOKUP(H476,'Drop Down'!K:L,2,0))*(IndexMatch!B:B=L476),0)),\"Service Already Opened\"),\"N/A\")","v":"Service Already Opened"},0,{"$f":"IF(O476>VLOOKUP(L476,'Drop Down'!$A$3:$B$10,2,0),\"1\",\"0\")","v":"0"},0,{"$f":"SUM(Table1[[#This Row],[Case Aide Hours]],Table1[[#This Row],[Case Aide Travel Time]])","v":0},{"$f":"IFERROR(IF(OR(Table1[[#This Row],[Child Support Level]]=\"Support Services Lvl 1\", Table1[[#This Row],[Child Support Level]]=\"Support Services Lvl 2\",Table1[[#This Row],[Child Support Level]]=\"Select\"),\"Case Aid Not Allowed\", PRODUCT(Table1[[#This Row],[Total Case Aide]],VLOOKUP(Table1[[#This Row],[County Where Youth Resides]],'Drop Down'!K:M,3,0))),\"0\")","v":"Case Aid Not Allowed"},"No",0,0]
["Select","-","-","-","-","DD/MM/YYYY","DD/MM/YYYY","Select","Select",{"$f":"VLOOKUP(Table1[[#This Row],[DCYF Case Region]],'Drop Down'!$F$3:$G$9,2,0)","v":"Select"},"Select","Select","Select",{"$f":"IFERROR(IF(M477=\"No\",INDEX(IndexMatch!C:C,MATCH(1,(IndexMatch!A:A=VLOOKUP(H477,'Drop Down'!K:L,2,0))*(IndexMatch!B:B=L477),0)),\"Service Already Opened\"),\"N/A\")","v":"Service Already Opened"},0,{"$f":"IF(O477>VLOOKUP(L477,'Drop Down'!$A$3:$B$10,2,0),\"1\",\"0\")","v":"0"},0,{"$f":"SUM(Table1[[#This Row],[Case Aide Hours]],Table1[[#This Row],[Case Aide Travel Time]])","v":0},{"$f":"IFERROR(IF(OR(Table1[[#This Row],[Child Support Level]]=\"Support Services Lvl 1\", Table1[[#This Row],[Child Support Level]]=\"Support Services Lvl 2\",Table1[[#This Row],[Child Support Level]]=\"Select\"),\"Case Aid Not Allowed\", PRODUCT(Table1[[#This Row],[Total Case Aide]],VLOOKUP(Table1[[#This Row],[County Where Youth Resides]],'Drop Down'!K:M,3,0))),\"0\")","v":"Case Aid Not Allowed"},"No",0,0]
["Select","-","-","-","-","DD/MM/YYYY","DD/MM/YYYY","Select","Select",{"$f":"VLOOKUP(Table1[[#This Row],[DCYF Case Region]],'Drop Down'!$F$3:$G$9,2,0)","v":"Select"},"Select","Select","Select",{"$f":"IFERROR(IF(M478=\"No\",INDEX(IndexMatch!C:C,MATCH(1,(IndexMatch!A:A=VLOOKUP(H478,'Drop Down'!K:L,2,0))*(IndexMatch!B:B=L478),0)),\"Service Already Opened\"),\"N/A\")","v":"Service Already Opened"},0,{"$f":"IF(O478>VLOOKUP(L478,'Drop Down'!$A$3:$B$10,2,0),\"1\",\"0\")","v":"0"},0,{"$f":"SUM(Table1[[#This Row],[Case Aide Hours]],Table1[[#This Row],[Case Aide Travel Time]])","v":0},{"$f":"IFERROR(IF(OR(Table1[[#This Row],[Child Support Level]]=\"Support Services Lvl 1\", Table1[[#This Row],[Child Support Level]]=\"Support Services Lvl 2\",Table1[[#This Row],[Child Support Level]]=\"Select\"),\"Case Aid Not Allowed\", PRODUCT(Table1[[#This Row],[Total Case Aide]],VLOOKUP(Table1[[#This Row],[County Where Youth Resides]],'Drop Down'!K:M,3,0))),\"0\")","v":"Case Aid Not Allowed"},"No",0,0]
["Select","-","-","-","-","DD/MM/YYYY","DD/MM/YYYY","Select","Select",{"$f":"VLOOKUP(Table1[[#This Row],[DCYF Case Region]],'Drop Down'!$F$3:$G$9,2,0)","v":"Select"},"Select","Select","Select",{"$f":"IFERROR(IF(M479=\"No\",INDEX(IndexMatch!C:C,MATCH(1,(IndexMatch!A:A=VLOOKUP(H479,'Drop Down'!K:L,2,0))*(IndexMatch!B:B=L479),0)),\"Service Already Opened\"),\"N/A\")","v":"Service Already Opened"},0,{"$f":"IF(O479>VLOOKUP(L479,'Drop Down'!$A$3:$B$10,2,0),\"1\",\"0\")","v":"0"},0,{"$f":"SUM(Table1[[#This Row],[Case Aide Hours]],Table1[[#This Row],[Case Aide Travel Time]])","v":0},{"$f":"IFERROR(IF(OR(Table1[[#This Row],[Child Support Level]]=\"Support Services Lvl 1\", Table1[[#This Row],[Child Support Level]]=\"Support Services Lvl 2\",Table1[[#This Row],[Child Support Level]]=\"Select\"),\"Case Aid Not Allowed\", PRODUCT(Table1[[#This Row],[Total Case Aide]],VLOOKUP(Table1[[#This Row],[County Where Youth Resides]],'Drop Down'!K:M,3,0))),\"0\")","v":"Case Aid Not Allowed"},"No",0,0]
["Select","-","-","-","-","DD/MM/YYYY","DD/MM/YYYY","Select","Select",{"$f":"VLOOKUP(Table1[[#This Row],[DCYF Case Region]],'Drop Down'!$F$3:$G$9,2,0)","v":"Select"},"Select","Select","Select",{"$f":"IFERROR(IF(M480=\"No\",INDEX(IndexMatch!C:C,MATCH(1,(IndexMatch!A:A=VLOOKUP(H480,'Drop Down'!K:L,2,0))*(IndexMatch!B:B=L480),0)),\"Service Already Opened\"),\"N/A\")","v":"Service Already Opened"},0,{"$f":"IF(O480>VLOOKUP(L480,'Drop Down'!$A$3:$B$10,2,0),\"1\",\"0\")","v":"0"},0,{"$f":"SUM(Table1[[#This Row],[Case Aide Hours]],Table1[[#This Row],[Case Aide Travel Time]])","v":0},{"$f":"IFERROR(IF(OR(Table1[[#This Row],[Child Support Level]]=\"Support Services Lvl 1\", Table1[[#This Row],[Child Support Level]]=\"Support Services Lvl 2\",Table1[[#This Row],[Child Support Level]]=\"Select\"),\"Case Aid Not Allowed\", PRODUCT(Table1[[#This Row],[Total Case Aide]],VLOOKUP(Table1[[#This Row],[County Where Youth Resides]],'Drop Down'!K:M,3,0))),\"0\")","v":"Case Aid Not Allowed"},"No",0,0]
["Select","-","-","-","-","DD/MM/YYYY","DD/MM/YYYY","Select","Select",{"$f":"VLOOKUP(Table1[[#This Row],[DCYF Case Region]],'Drop Down'!$F$3:$G$9,2,0)","v":"Select"},"Select","Select","Select",{"$f":"IFERROR(IF(M481=\"No\",INDEX(IndexMatch!C:C,MATCH(1,(IndexMatch!A:A=VLOOKUP(H481,'Drop Down'!K:L,2,0))*(IndexMatch!B:B=L481),0)),\"Service Already Opened\"),\"N/A\")","v":"Service Already Opened"},0,{"$f":"IF(O481>VLOOKUP(L481,'Drop Down'!$A$3:$B$10,2,0),\"1\",\"0\")","v":"0"},0,{"$f":"SUM(Table1[[#This Row],[Case Aide Hours]],Table1[[#This Row],[Case Aide Travel Time]])","v":0},{"$f":"IFERROR(IF(OR(Table1[[#This Row],[Child Support Level]]=\"Support Services Lvl 1\", Table1[[#This Row],[Child Support Level]]=\"Support Services Lvl 2\",Table1[[#This Row],[Child Support Level]]=\"Select\"),\"Case Aid Not Allowed\", PRODUCT(Table1[[#This Row],[Total Case Aide]],VLOOKUP(Table1[[#This Row],[County Where Youth Resides]],'Drop Down'!K:M,3,0))),\"0\")","v":"Case Aid Not Allowed"},"No",0,0]
["Select","-","-","-","-","DD/MM/YYYY","DD/MM/YYYY","Select","Select",{"$f":"VLOOKUP(Table1[[#This Row],[DCYF Case Region]],'Drop Down'!$F$3:$G$9,2,0)","v":"Select"},"Select","Select","Select",{"$f":"IFERROR(IF(M482=\"No\",INDEX(IndexMatch!C:C,MATCH(1,(IndexMatch!A:A=VLOOKUP(H482,'Drop Down'!K:L,2,0))*(IndexMatch!B:B=L482),0)),\"Service Already Opened\"),\"N/A\")","v":"Service Already Opened"},0,{"$f":"IF(O482>VLOOKUP(L482,'Drop Down'!$A$3:$B$10,2,0),\"1\",\"0\")","v":"0"},0,{"$f":"SUM(Table1[[#This Row],[Case Aide Hours]],Table1[[#This Row],[Case Aide Travel Time]])","v":0},{"$f":"IFERROR(IF(OR(Table1[[#This Row],[Child Support Level]]=\"Support Services Lvl 1\", Table1[[#This Row],[Child Support Level]]=\"Support Services Lvl 2\",Table1[[#This Row],[Child Support Level]]=\"Select\"),\"Case Aid Not Allowed\", PRODUCT(Table1[[#This Row],[Total Case Aide]],VLOOKUP(Table1[[#This Row],[County Where Youth Resides]],'Drop Down'!K:M,3,0))),\"0\")","v":"Case Aid Not Allowed"},"No",0,0]
["Select","-","-","-","-","DD/MM/YYYY","DD/MM/YYYY","Select","Select",{"$f":"VLOOKUP(Table1[[#This Row],[DCYF Case Region]],'Drop Down'!$F$3:$G$9,2,0)","v":"Select"},"Select","Select","Select",{"$f":"IFERROR(IF(M483=\"No\",INDEX(IndexMatch!C:C,MATCH(1,(IndexMatch!A:A=VLOOKUP(H483,'Drop Down'!K:L,2,0))*(IndexMatch!B:B=L483),0)),\"Service Already Opened\"),\"N/A\")","v":"Service Already Opened"},0,{"$f":"IF(O483>VLOOKUP(L483,'Drop Down'!$A$3:$B$10,2,0),\"1\",\"0\")","v":"0"},0,{"$f":"SUM(Table1[[#This Row],[Case Aide Hours]],Table1[[#This Row],[Case Aide Travel Time]])","v":0},{"$f":"IFERROR(IF(OR(Table1[[#This Row],[Child Support Level]]=\"Support Services Lvl 1\", Table1[[#This Row],[Child Support Level]]=\"Support Services Lvl 2\",Table1[[#This Row],[Child Support Level]]=\"Select\"),\"Case Aid Not Allowed\", PRODUCT(Table1[[#This Row],[Total Case Aide]],VLOOKUP(Table1[[#This Row],[County Where Youth Resides]],'Drop Down'!K:M,3,0))),\"0\")","v":"Case Aid Not Allowed"},"No",0,0]
["Select","-","-","-","-","DD/MM/YYYY","DD/MM/YYYY","Select","Select",{"$f":"VLOOKUP(Table1[[#This Row],[DCYF Case Region]],'Drop Down'!$F$3:$G$9,2,0)","v":"Select"},"Select","Select","Select",{"$f":"IFERROR(IF(M484=\"No\",INDEX(IndexMatch!C:C,MATCH(1,(IndexMatch!A:A=VLOOKUP(H484,'Drop Down'!K:L,2,0))*(IndexMatch!B:B=L484),0)),\"Service Already Opened\"),\"N/A\")","v":"Service Already Opened"},0,{"$f":"IF(O484>VLOOKUP(L484,'Drop Down'!$A$3:$B$10,2,0),\"1\",\"0\")","v":"0"},0,{"$f":"SUM(Table1[[#This Row],[Case Aide Hours]],Table1[[#This Row],[Case Aide Travel Time]])","v":0},{"$f":"IFERROR(IF(OR(Table1[[#This Row],[Child Support Level]]=\"Support Services Lvl 1\", Table1[[#This Row],[Child Support Level]]=\"Support Services Lvl 2\",Table1[[#This Row],[Child Support Level]]=\"Select\"),\"Case Aid Not Allowed\", PRODUCT(Table1[[#This Row],[Total Case Aide]],VLOOKUP(Table1[[#This Row],[County Where Youth Resides]],'Drop Down'!K:M,3,0))),\"0\")","v":"Case Aid Not Allowed"},"No",0,0]
["Select","-","-","-","-","DD/MM/YYYY","DD/MM/YYYY","Select","Select",{"$f":"VLOOKUP(Table1[[#This Row],[DCYF Case Region]],'Drop Down'!$F$3:$G$9,2,0)","v":"Select"},"Select","Select","Select",{"$f":"IFERROR(IF(M485=\"No\",INDEX(IndexMatch!C:C,MATCH(1,(IndexMatch!A:A=VLOOKUP(H485,'Drop Down'!K:L,2,0))*(IndexMatch!B:B=L485),0)),\"Service Already Opened\"),\"N/A\")","v":"Service Already Opened"},0,{"$f":"IF(O485>VLOOKUP(L485,'Drop Down'!$A$3:$B$10,2,0),\"1\",\"0\")","v":"0"},0,{"$f":"SUM(Table1[[#This Row],[Case Aide Hours]],Table1[[#This Row],[Case Aide Travel Time]])","v":0},{"$f":"IFERROR(IF(OR(Table1[[#This Row],[Child Support Level]]=\"Support Services Lvl 1\", Table1[[#This Row],[Child Support Level]]=\"Support Services Lvl 2\",Table1[[#This Row],[Child Support Level]]=\"Select\"),\"Case Aid Not Allowed\", PRODUCT(Table1[[#This Row],[Total Case Aide]],VLOOKUP(Table1[[#This Row],[County Where Youth Resides]],'Drop Down'!K:M,3,0))),\"0\")","v":"Case Aid Not Allowed"},"No",0,0]
["Select","-","-","-","-","DD/MM/YYYY","DD/MM/YYYY","Select","Select",{"$f":"VLOOKUP(Table1[[#This Row],[DCYF Case Region]],'Drop Down'!$F$3:$G$9,2,0)","v":"Select"},"Select","Select","Select",{"$f":"IFERROR(IF(M486=\"No\",INDEX(IndexMatch!C:C,MATCH(1,(IndexMatch!A:A=VLOOKUP(H486,'Drop Down'!K:L,2,0))*(IndexMatch!B:B=L486),0)),\"Service Already Opened\"),\"N/A\")","v":"Service Already Opened"},0,{"$f":"IF(O486>VLOOKUP(L486,'Drop Down'!$A$3:$B$10,2,0),\"1\",\"0\")","v":"0"},0,{"$f":"SUM(Table1[[#This Row],[Case Aide Hours]],Table1[[#This Row],[Case Aide Travel Time]])","v":0},{"$f":"IFERROR(IF(OR(Table1[[#This Row],[Child Support Level]]=\"Support Services Lvl 1\", Table1[[#This Row],[Child Support Level]]=\"Support Services Lvl 2\",Table1[[#This Row],[Child Support Level]]=\"Select\"),\"Case Aid Not Allowed\", PRODUCT(Table1[[#This Row],[Total Case Aide]],VLOOKUP(Table1[[#This Row],[County Where Youth Resides]],'Drop Down'!K:M,3,0))),\"0\")","v":"Case Aid Not Allowed"},"No",0,0]
["Select","-","-","-","-","DD/MM/YYYY","DD/MM/YYYY","Select","Select",{"$f":"VLOOKUP(Table1[[#This Row],[DCYF Case Region]],'Drop Down'!$F$3:$G$9,2,0)","v":"Select"},"Select","Select","Select",{"$f":"IFERROR(IF(M487=\"No\",INDEX(IndexMatch!C:C,MATCH(1,(IndexMatch!A:A=VLOOKUP(H487,'Drop Down'!K:L,2,0))*(IndexMatch!B:B=L487),0)),\"Service Already Opened\"),\"N/A\")","v":"Service Already Opened"},0,{"$f":"IF(O487>VLOOKUP(L487,'Drop Down'!$A$3:$B$10,2,0),\"1\",\"0\")","v":"0"},0,{"$f":"SUM(Table1[[#This Row],[Case Aide Hours]],Table1[[#This Row],[Case Aide Travel Time]])","v":0},{"$f":"IFERROR(IF(OR(Table1[[#This Row],[Child Support Level]]=\"Support Services Lvl 1\", Table1[[#This Row],[Child Support Level]]=\"Support Services Lvl 2\",Table1[[#This Row],[Child Support Level]]=\"Select\"),\"Case Aid Not Allowed\", PRODUCT(Table1[[#This Row],[Total Case Aide]],VLOOKUP(Table1[[#This Row],[County Where Youth Resides]],'Drop Down'!K:M,3,0))),\"0\")","v":"Case Aid Not Allowed"},"No",0,0]
["Select","-","-","-","-","DD/MM/YYYY","DD/MM/YYYY","Select","Select",{"$f":"VLOOKUP(Table1[[#This Row],[DCYF Case Region]],'Drop Down'!$F$3:$G$9,2,0)","v":"Select"},"Select","Select","Select",{"$f":"IFERROR(IF(M488=\"No\",INDEX(IndexMatch!C:C,MATCH(1,(IndexMatch!A:A=VLOOKUP(H488,'Drop Down'!K:L,2,0))*(IndexMatch!B:B=L488),0)),\"Service Already Opened\"),\"N/A\")","v":"Service Already Opened"},0,{"$f":"IF(O488>VLOOKUP(L488,'Drop Down'!$A$3:$B$10,2,0),\"1\",\"0\")","v":"0"},0,{"$f":"SUM(Table1[[#This Row],[Case Aide Hours]],Table1[[#This Row],[Case Aide Travel Time]])","v":0},{"$f":"IFERROR(IF(OR(Table1[[#This Row],[Child Support Level]]=\"Support Services Lvl 1\", Table1[[#This Row],[Child Support Level]]=\"Support Services Lvl 2\",Table1[[#This Row],[Child Support Level]]=\"Select\"),\"Case Aid Not Allowed\", PRODUCT(Table1[[#This Row],[Total Case Aide]],VLOOKUP(Table1[[#This Row],[County Where Youth Resides]],'Drop Down'!K:M,3,0))),\"0\")","v":"Case Aid Not Allowed"},"No",0,0]
["Select","-","-","-","-","DD/MM/YYYY","DD/MM/YYYY","Select","Select",{"$f":"VLOOKUP(Table1[[#This Row],[DCYF Case Region]],'Drop Down'!$F$3:$G$9,2,0)","v":"Select"},"Select","Select","Select",{"$f":"IFERROR(IF(M489=\"No\",INDEX(IndexMatch!C:C,MATCH(1,(IndexMatch!A:A=VLOOKUP(H489,'Drop Down'!K:L,2,0))*(IndexMatch!B:B=L489),0)),\"Service Already Opened\"),\"N/A\")","v":"Service Already Opened"},0,{"$f":"IF(O489>VLOOKUP(L489,'Drop Down'!$A$3:$B$10,2,0),\"1\",\"0\")","v":"0"},0,{"$f":"SUM(Table1[[#This Row],[Case Aide Hours]],Table1[[#This Row],[Case Aide Travel Time]])","v":0},{"$f":"IFERROR(IF(OR(Table1[[#This Row],[Child Support Level]]=\"Support Services Lvl 1\", Table1[[#This Row],[Child Support Level]]=\"Support Services Lvl 2\",Table1[[#This Row],[Child Support Level]]=\"Select\"),\"Case Aid Not Allowed\", PRODUCT(Table1[[#This Row],[Total Case Aide]],VLOOKUP(Table1[[#This Row],[County Where Youth Resides]],'Drop Down'!K:M,3,0))),\"0\")","v":"Case Aid Not Allowed"},"No",0,0]
["Select","-","-","-","-","DD/MM/YYYY","DD/MM/YYYY","Select","Select",{"$f":"VLOOKUP(Table1[[#This Row],[DCYF Case Region]],'Drop Down'!$F$3:$G$9,2,0)","v":"Select"},"Select","Select","Select",{"$f":"IFERROR(IF(M490=\"No\",INDEX(IndexMatch!C:C,MATCH(1,(IndexMatch!A:A=VLOOKUP(H490,'Drop Down'!K:L,2,0))*(IndexMatch!B:B=L490),0)),\"Service Already Opened\"),\"N/A\")","v":"Service Already Opened"},0,{"$f":"IF(O490>VLOOKUP(L490,'Drop Down'!$A$3:$B$10,2,0),\"1\",\"0\")","v":"0"},0,{"$f":"SUM(Table1[[#This Row],[Case Aide Hours]],Table1[[#This Row],[Case Aide Travel Time]])","v":0},{"$f":"IFERROR(IF(OR(Table1[[#This Row],[Child Support Level]]=\"Support Services Lvl 1\", Table1[[#This Row],[Child Support Level]]=\"Support Services Lvl 2\",Table1[[#This Row],[Child Support Level]]=\"Select\"),\"Case Aid Not Allowed\", PRODUCT(Table1[[#This Row],[Total Case Aide]],VLOOKUP(Table1[[#This Row],[County Where Youth Resides]],'Drop Down'!K:M,3,0))),\"0\")","v":"Case Aid Not Allowed"},"No",0,0]
["Select","-","-","-","-","DD/MM/YYYY","DD/MM/YYYY","Select","Select",{"$f":"VLOOKUP(Table1[[#This Row],[DCYF Case Region]],'Drop Down'!$F$3:$G$9,2,0)","v":"Select"},"Select","Select","Select",{"$f":"IFERROR(IF(M491=\"No\",INDEX(IndexMatch!C:C,MATCH(1,(IndexMatch!A:A=VLOOKUP(H491,'Drop Down'!K:L,2,0))*(IndexMatch!B:B=L491),0)),\"Service Already Opened\"),\"N/A\")","v":"Service Already Opened"},0,{"$f":"IF(O491>VLOOKUP(L491,'Drop Down'!$A$3:$B$10,2,0),\"1\",\"0\")","v":"0"},0,{"$f":"SUM(Table1[[#This Row],[Case Aide Hours]],Table1[[#This Row],[Case Aide Travel Time]])","v":0},{"$f":"IFERROR(IF(OR(Table1[[#This Row],[Child Support Level]]=\"Support Services Lvl 1\", Table1[[#This Row],[Child Support Level]]=\"Support Services Lvl 2\",Table1[[#This Row],[Child Support Level]]=\"Select\"),\"Case Aid Not Allowed\", PRODUCT(Table1[[#This Row],[Total Case Aide]],VLOOKUP(Table1[[#This Row],[County Where Youth Resides]],'Drop Down'!K:M,3,0))),\"0\")","v":"Case Aid Not Allowed"},"No",0,0]
["Select","-","-","-","-","DD/MM/YYYY","DD/MM/YYYY","Select","Select",{"$f":"VLOOKUP(Table1[[#This Row],[DCYF Case Region]],'Drop Down'!$F$3:$G$9,2,0)","v":"Select"},"Select","Select","Select",{"$f":"IFERROR(IF(M492=\"No\",INDEX(IndexMatch!C:C,MATCH(1,(IndexMatch!A:A=VLOOKUP(H492,'Drop Down'!K:L,2,0))*(IndexMatch!B:B=L492),0)),\"Service Already Opened\"),\"N/A\")","v":"Service Already Opened"},0,{"$f":"IF(O492>VLOOKUP(L492,'Drop Down'!$A$3:$B$10,2,0),\"1\",\"0\")","v":"0"},0,{"$f":"SUM(Table1[[#This Row],[Case Aide Hours]],Table1[[#This Row],[Case Aide Travel Time]])","v":0},{"$f":"IFERROR(IF(OR(Table1[[#This Row],[Child Support Level]]=\"Support Services Lvl 1\", Table1[[#This Row],[Child Support Level]]=\"Support Services Lvl 2\",Table1[[#This Row],[Child Support Level]]=\"Select\"),\"Case Aid Not Allowed\", PRODUCT(Table1[[#This Row],[Total Case Aide]],VLOOKUP(Table1[[#This Row],[County Where Youth Resides]],'Drop Down'!K:M,3,0))),\"0\")","v":"Case Aid Not Allowed"},"No",0,0]
["Select","-","-","-","-","DD/MM/YYYY","DD/MM/YYYY","Select","Select",{"$f":"VLOOKUP(Table1[[#This Row],[DCYF Case Region]],'Drop Down'!$F$3:$G$9,2,0)","v":"Select"},"Select","Select","Select",{"$f":"IFERROR(IF(M493=\"No\",INDEX(IndexMatch!C:C,MATCH(1,(IndexMatch!A:A=VLOOKUP(H493,'Drop Down'!K:L,2,0))*(IndexMatch!B:B=L493),0)),\"Service Already Opened\"),\"N/A\")","v":"Service Already Opened"},0,{"$f":"IF(O493>VLOOKUP(L493,'Drop Down'!$A$3:$B$10,2,0),\"1\",\"0\")","v":"0"},0,{"$f":"SUM(Table1[[#This Row],[Case Aide Hours]],Table1[[#This Row],[Case Aide Travel Time]])","v":0},{"$f":"IFERROR(IF(OR(Table1[[#This Row],[Child Support Level]]=\"Support Services Lvl 1\", Table1[[#This Row],[Child Support Level]]=\"Support Services Lvl 2\",Table1[[#This Row],[Child Support Level]]=\"Select\"),\"Case Aid Not Allowed\", PRODUCT(Table1[[#This Row],[Total Case Aide]],VLOOKUP(Table1[[#This Row],[County Where Youth Resides]],'Drop Down'!K:M,3,0))),\"0\")","v":"Case Aid Not Allowed"},"No",0,0]
["Select","-","-","-","-","DD/MM/YYYY","DD/MM/YYYY","Select","Select",{"$f":"VLOOKUP(Table1[[#This Row],[DCYF Case Region]],'Drop Down'!$F$3:$G$9,2,0)","v":"Select"},"Select","Select","Select",{"$f":"IFERROR(IF(M494=\"No\",INDEX(IndexMatch!C:C,MATCH(1,(IndexMatch!A:A=VLOOKUP(H494,'Drop Down'!K:L,2,0))*(IndexMatch!B:B=L494),0)),\"Service Already Opened\"),\"N/A\")","v":"Service Already Opened"},0,{"$f":"IF(O494>VLOOKUP(L494,'Drop Down'!$A$3:$B$10,2,0),\"1\",\"0\")","v":"0"},0,{"$f":"SUM(Table1[[#This Row],[Case Aide Hours]],Table1[[#This Row],[Case Aide Travel Time]])","v":0},{"$f":"IFERROR(IF(OR(Table1[[#This Row],[Child Support Level]]=\"Support Services Lvl 1\", Table1[[#This Row],[Child Support Level]]=\"Support Services Lvl 2\",Table1[[#This Row],[Child Support Level]]=\"Select\"),\"Case Aid Not Allowed\", PRODUCT(Table1[[#This Row],[Total Case Aide]],VLOOKUP(Table1[[#This Row],[County Where Youth Resides]],'Drop Down'!K:M,3,0))),\"0\")","v":"Case Aid Not Allowed"},"No",0,0]

{"sheet":"Fee Table","index":2,"n_rows":45,"n_cols":14,"rows_kept":45,"cut":false,"hidden":false,"merged":[[21,9,25,9],[26,9,44,9],[37,1,48,7],[21,1,21,2],[0,1,0,13],[2,2,2,3],[2,4,2,7],[2,8,2,12]]}
[null,"CPA Contract "]
[]
[null,null,"Zone 1",null,"Zone 2",null,null,null,"Zone 3",null,null,null,null,"Zone 4"]
[null,null,"Northeast","South Central","Pacific Mountain","Southeast","Northcentral ","Central ","Southwest","Olympic","Pierce- East/West","Snohomish","Northwest","King- North/South"]
[]
[]
[null,"Support Services Lvl 1",495,495,529,529,529,529,508,508,508,508,508,564]
[null,"Support Services Lvl 2",532,532,569,569,569,569,547,547,547,547,547,607]
[null,"Support Services Lvl 3",577,577,616,616,616,616,592,592,592,592,592,657]
[null,"Support Services Lvl 4",631,631,673,673,673,673,648,648,648,648,648,718]
[null,"Support Services Lvl 5",782,782,834,834,834,834,803,803,803,803,803,890]
[null,"Support Services Lvl 6",833,833,889,889,889,889,855,855,855,855,855,948]
[null,"Support Services Lvl 7",961,961,1025,1025,1025,1025,987,987,987,987,987,1093]
[]
[]
[null,"Case Aide Hourly ",55.78,55.78,57.84,57.84,57.84,57.84,56.72,56.72,56.72,56.72,56.72,62.68]
[]
[]
[]
[]
[]
[null,"Authorized hours of Service Per month, per level, per child/youth",null,null,null,null,null,null,null,"Zone",null,null,"Olympic"]
[null,"Support Services Lvl 1",0,null,null,null,null,null,null,null,null,"Central ","Snohomish"]
[null,"Support Services Lvl 2",0,null,null,null,null,null,null,null,null,"Northcentral ","Northwest"]
[null,"Support Services Lvl 3",9,null,null,null,null,null,null,null,"Northeast","Pacific Mountain","Southwest"]
[null,"Support Services Lvl 4",12,null,null,null,null,null,null,null,"South Central","Southeast","Pierce- East/West","King- North/South"]
[null,"Support Services Lvl 5",15,null,null,null,null,null,null,"County","Lincoln","Adams","Island","King"]
[null,"Support Services Lvl 6",17,null,null,null,null,null,null,null,"Klickitat","Asotin","Clallam"]
[null,"Support Services Lvl 7",20,null,null,null,null,null,null,null,"Pend Oreille","Benton","Clark"]
[null,null,null,null,null,null,null,null,null,null,"Spokane","Chelan","Cowlitz"]
[null,null,null,null,null,null,null,null,null,null,"Stevens","Columbia","Jefferson"]
[null,null,null,null,null,null,null,null,null,null,"Yakima","Douglas","Kitsap"]
[null,null,null,null,null,null,null,null,null,null,null,"Ferry","Pierce"]
[null,null,null,null,null,null,null,null,null,null,null,"Franklin","San Juan"]
[null,null,null,null,null,null,null,null,null,null,null,"Garfield","Skagit"]
[null,null,null,null,null,null,null,null,null,null,null,"Grant","Skamania"]
[null,null,null,null,null,null,null,null,null,null,null,"Grays Harbor","Snohomish"]
[null,"DCYF shall pay the Contractor for actual service related travel, which shall only include: \n• Travel to and from the Caregivers home to provide services; \n• Travel providing services as authorized in the Caregiver service plan; \n• The Contractor shall adhere to the following travel time stipulations: \n       1 Arrange travel to limit travel time; \n       2 Allowable travel time is portal to portal. DCYF will use Google Maps to evaluate reasonableness of claimed time; \n       3 Allowed travel time to the Cargiver home shall be calculated as the distance from the workplace, location where the Case Aide \n             normally performs his/her work or  previous client appointment; \n        4 No reimbursement for travel shall be paid for travel between counselor’s residence and office; and\n        5  Travel time shall be reasonable. \n\nCurrent state rate on date service delivered. Current rates for travel can be accessed at: http://ofm.wa.gov/policy/10.90a.pdf \n\nAny travel beyond 50 miles to the appointment or returning (i.e. one\u0002way) must be authorized by the Regional Program Manager",null,null,null,null,null,null,null,null,null,"Kittitas","Wahkiakum"]
[null,null,null,null,null,null,null,null,null,null,null,"Lewis","Whatcom"]
[null,null,null,null,null,null,null,null,null,null,null,"Mason"]
[null,null,null,null,null,null,null,null,null,null,null,"Okanogan"]
[null,null,null,null,null,null,null,null,null,null,null,"Pacific"]
[null,null,null,null,null,null,null,null,null,null,null,"Thurston"]
[null,null,null,null,null,null,null,null,null,null,null,"Walla Walla"]
[null,null,null,null,null,null,null,null,null,null,null,"Whitman"]

{"sheet":"Offices","index":3,"n_rows":123,"n_cols":20,"rows_kept":123,"cut":false,"hidden":true,"merged":[]}
["cd_dept_unit","tx_dept_unit","cd_dept_unit","tx_ofc_div",null,null,null,"Reasions",null,null,"Select"]
[772,"DJR Region 1",772,"Region 1",{"$error":"#N/A"},null,null,"[Select]",null,null,"Finished",null,null,"Select","Select","Select","Select","Select","Select","Select"]
[721,"Clarkston",721,"Region 1",5,null,null,"PCA Issue",null,null,"Not Finished",null,null,null,"Clarkston","White Salmon","Tribal Payment Only","Martin Luther King Jr. ","Parkland (Satellite)","Forks"]
[717,"Republic",717,"Region 1",7,null,null,"Insufficient Info In CLU",null,null,null,null,null,null,"Republic","Goldendale","Region 3 Adoptions"," Office of Indian Child Welfare - R04","R5 S'Klallam Tribe","Port Townsend"]
[716,"Colfax",716,"Region 1",16,null,null,"FA Error",null,null,null,null,null,null,"Colfax","Region 2 Facility Investigation","Region 3 Facility Investigation","Region 4 Family Treatment Court","Puyallup ","Olympia DCFS (Tumwater)"]
[715,"Colville",715,"Region 1",12,null,null,"Placement Correction",null,null,null,null,null,null,"Colville","Sunnyside","Sky Valley","King West DCFS","Region 5 Facility Investigation","South Bend"]
[714,"Spokane Central",714,"Region 1",9,null,null,"Provider Issue",null,null,null,null,null,null,"Spokane Central","Toppenish","Friday Harbor","King South-West","Tacoma ","Shelton"]
[713,"Omak",713,"Region 1",22,null,null,"FamLink Error",null,null,null,null,null,null,"Omak","Yakima","Oak Harbor","Region 4 Adoptions","Bremerton","Centralia"]
[712,"Moses Lake",712,"Region 1",18,null,null,"Insufficient Paperwork",null,null,null,null,null,null,"Moses Lake","Walla Walla","Smokey Point","West Seattle DCFS","Region 5 Adoptions","Aberdeen"]
[711,"Wenatchee",711,"Region 1",19,null,null,"Weekend Placement",null,null,null,null,null,null,"Wenatchee","Ellensburg DCFS","Lynnwood","King East DCFS","Lakewood","Kelso"]
[710,"Newport",710,"Region 1",10,null,null,"Respite",null,null,null,null,null,null,"Newport","Tri-Cities","Bellingham","Reg 4 AS","Vancouver - Clark","Vancouver - Cascade"]
[709,"Lincoln County (Spokane/Lincoln)",709,"Region 1",17,null,null,null,null,null,null,null,null,null,"Lincoln County (Spokane/Lincoln)","Region 2 ","Everett","King South-East","Reg 5 AS","Port Angeles"]
[708,"Region 1 Facility Investigation",708,"Region 1",{"$error":"#N/A"},null,null,null,null,null,null,null,null,null,"Region 1 Facility Investigation","Region 2 Adoptions","Mount Vernon","Martin Luther King Jr. Office","Tacoma","Long Beach"]
[701,"Region 1 ",701,"Region 1",88,null,null,null,null,null,null,null,null,null,"Region 1 ","Reg 2 AS","Bellingham","Office of Indian Child Welfare - R04","Bremerton","Stevenson"]
[695,"Spokane ICW",695,"Region 1",77,null,null,null,null,null,null,null,null,null,"Spokane ICW","Ellensburg",null,null,"Parkland","Vancouver - Columbia"]
[694,"Spokane Valley",694,"Region 1",76,null,null,null,null,null,null,null,null,null,"Spokane Valley","Region 2 Office",null,null,"Puyallup Office","Reg 6 AS"]
[693,"Spokane North",693,"Region 1",11,null,null,null,null,null,null,null,null,null,"Spokane North",null,null,null,"Tacoma Office","Vancouver"]
[681,"Region 1 Adoptions",null,"Region 1",null,null,null,null,null,null,null,null,null,null,"Region 1 Adoptions",null,null,null,"Region 5 Office","Olympia"]
[601,"Reg 1 AS",601,"Region 1",{"$error":"#N/A"},null,null,null,null,null,null,null,null,null,"Reg 1 AS",null,null,null,null,"Aberdeen"]
[null,"Spokane",null,"Region 1",null,null,null,null,null,null,null,null,null,null,"Spokane",null,null,null,null,"Forks DCYF"]
[773,"DJR Region 2",773,"Region 2",{"$error":"#N/A"},null,null,null,null,null,null,null,null,null,null,null,null,null,null,"Region 6 Office"]
[765,"White Salmon",765,"Region 2",66]
[756,"Goldendale",756,"Region 2",65]
[728,"Region 2 Facility Investigation",728,"Region 2",{"$error":"#N/A"}]
[727,"Sunnyside",727,"Region 2",3]
[726,"Toppenish",726,"Region 2",4]
[725,"Yakima",725,"Region 2",68]
[724,"Walla Walla",724,"Region 2",6]
[723,"Ellensburg DCFS",723,"Region 2",64]
[722,"Tri-Cities",722,"Region 2",1]
[702,"Region 2 ",702,"Region 2",{"$error":"#N/A"}]
[682,"Region 2 Adoptions",null,"Region 2"]
[602,"Reg 2 AS",602,"Region 2",{"$error":"#N/A"}]
[null,"Ellensburg",null,"Region 2"]
[null,"Region 2 Office",null,"Region 2"]
[809,"Tribal Payment Only",809,"Region 3",62]
[801,"Region 3 Adoptions",801,"Region 3",{"$error":"#N/A"}]
[793,"Reg 3 Lummi Tribe",793,"Region 3",61]
[774,"DJR Region 3",774,"Region 3",{"$error":"#N/A"}]
[740,"Region 3 Facility Investigation",740,"Region 3",{"$error":"#N/A"}]
[739,"Native American ",739,"Region 3",{"$error":"#N/A"}]
[738,"Sky Valley",738,"Region 3",47]
[737,"Friday Harbor",737,"Region 3",24]
[736,"Oak Harbor",736,"Region 3",23]
[735,"Smokey Point",735,"Region 3",60]
[734,"Lynnwood",734,"Region 3",58]
[733,"Bellingham",733,"Region 3",26]
[732,"Everett",732,"Region 3",57]
[731,"Mount Vernon",731,"Region 3",25]
[730,"Region 3 After-Hours",730,"Region 3",{"$error":"#N/A"}]
[729,"Region 3 Out of Home Licensing",729,"Region 3",{"$error":"#N/A"}]
[703,"Region 3 ",703,"Region 3",{"$error":"#N/A"}]
[603,"Reg 3 AS",603,"Region 3",63]
[null,"Bellingham",null,"Region 3"]
[798,"Martin Luther King Jr. ",798,"Region 4",45]
[796," Office of Indian Child Welfare - R04",796,"Region 4",46]
[780,"Region 4 Family Treatment Court",780,"Region 4",52]
[775,"DJR Region 4",775,"Region 4",{"$error":"#N/A"}]
[747,"King West DCFS",747,"Region 4",56]
[746,"Reg 4 OCCP-See 983 and 984",746,"Region 4",49]
[745,"King Central Services - R04",745,"Region 4",54]
[744,"King South-West",744,"Region 4",41]
[743,"Region 4 Adoptions",743,"Region 4",51]
[742,"West Seattle DCFS",742,"Region 4",53]
[741,"King East DCFS",741,"Region 4",55]
[704,"Region 4 ",704,"Region 4",50]
[604,"Reg 4 AS",604,"Region 4",48]
[271,"King South-East",271,"Region 4",42]
[null,"Martin Luther King Jr. Office",null,"Region 4"]
[null,"Office of Indian Child Welfare - R04",null,"Region 4"]
[817,"Parkland (Satellite)",817,"Region 5",79]
[797,"R5 S'Klallam Tribe",797,"Region 5",82]
[790,"Puyallup ",790,"Region 5",80]
[776,"DJR Region 5",776,"Region 5",{"$error":"#N/A"}]
[755,"Region 5 Centralized Services",755,"Region 5",86]
[754,"Region 5 Facility Investigation",754,"Region 5",87]
[752,"Tacoma ",752,"Region 5",81]
[751,"Bremerton",751,"Region 5",29]
[705,"Region 5 ",705,"Region 5",84]
[698,"Region 5 Adoptions",698,"Region 5",85]
[697,"Lakewood",697,"Region 5",78]
[691,"Vancouver - Clark",691,"Region 5",73]
[605,"Reg 5 AS",605,"Region 5",83]
[null,"Tacoma",null,"Region 5"]
[null,"Bremerton",null,"Region 5"]
[null,"Parkland",null,"Region 5"]
[null,"Puyallup Office",null,"Region 5"]
[null,"Tacoma Office",null,"Region 5"]
[null,"Region 5 Office",null,"Region 5"]
[808,"Region 6 Centralized Services",808,"Region 6",{"$error":"#N/A"}]
[807,"Region 6 Adoptions",807,"Region 6",{"$error":"#N/A"}]
[795,"Reg 6 Quinault Tribe",795,"Region 6",39]
[794,"Reg 6 Makah Tribe",794,"Region 6",38]
[779,"Morton DCFS  SEE 765",779,"Region 6",{"$error":"#N/A"}]
[778,"Taholah DCFS   SEE 771",778,"Region 6",{"$error":"#N/A"}]
[777,"DJR Region 6",777,"Region 6",{"$error":"#N/A"}]
[771,"Forks",771,"Region 6",27]
[770,"Port Townsend",770,"Region 6",31]
[769,"Olympia DCFS (Tumwater)",769,"Region 6",37]
[768,"South Bend",768,"Region 6",36,null,null,null,{"$f":"TODAY()","v":"2024-04-29"}]
[767,"Shelton",767,"Region 6",34]
[766,"Centralia",766,"Region 6",40]
[764,"Aberdeen",764,"Region 6",32]
[763,"Kelso",763,"Region 6",71]
[762,"Vancouver - Cascade",762,"Region 6",69]
[761,"Port Angeles",761,"Region 6",30]
[760,"Long Beach",760,"Region 6",35]
[759,"Region 6 Facility Investigation",null,"Region 6"]
[758,"Region 6 Out of Home Licensing",758,"Region 6",{"$error":"#N/A"}]
[757,"Stevenson",757,"Region 6",67]
[706,"Region 6 ",706,"Region 6",{"$error":"#N/A"}]
[696,"Vancouver - Columbia",696,"Region 6",70]
[606,"Reg 6 AS",606,"Region 6",{"$error":"#N/A"}]
[null,"Vancouver",null,"Region 6"]
[null,"Olympia",null,"Region 6"]
[null,"Aberdeen",null,"Region 6"]
[null,"Forks DCYF",null,"Region 6"]
[null,"Region 6 Office",null,"Region 6"]
[999,"SSPS Control",999,"Region 7",{"$error":"#N/A"}]
[989,"Central Intake",989,"Region 7",{"$error":"#N/A"}]
[799,"DCFS HQ Test ",799,"Region 7",{"$error":"#N/A"}]
[748,"Foster Care Medical",748,"Region 7",{"$error":"#N/A"}]
[700,"Head Quarters - (OB-2)",700,"Region 7",{"$error":"#N/A"}]

{"sheet":"Drop Down","index":4,"n_rows":63,"n_cols":20,"rows_kept":63,"cut":false,"hidden":true,"merged":[]}
[]
[]
["Select",0,null,"Select","Select","Select","Select","Select","Select",null,"Select",null,"Case Aide","Support Services Lvl 1","Support Services Lvl 2","Support Services Lvl 3","Support Services Lvl 4","Support Services Lvl 5","Support Services Lvl 6","Support Services Lvl 7"]
["Support Services Lvl 1",0,null,"Yes","One",1,"One",2023,"January",null,"Select","Select County",0,0,0,0,0,0,0,0]
["Support Services Lvl 2",0,null,"No","Two",2,"Two",2024,"February",null,"Lincoln","Zone 1",55.78,495,532,577,631,782,833,961]
["Support Services Lvl 3",9,null,null,"Three",3,"Three",2025,"March",null,"Klickitat","Zone 1",55.78,495,532,577,631,782,833,961]
["Support Services Lvl 4",12,null,null,"Four",4,"Four",2026,"April",null,"Pend Oreille","Zone 1",55.78,495,532,577,631,782,833,961]
["Support Services Lvl 5",15,null,null,"Five",5,"Five",2027,"May",null,"Spokane","Zone 1",55.78,495,532,577,631,782,833,961]
["Support Services Lvl 6",17,null,null,"Six",6,"Six",2028,"June",null,"Stevens","Zone 1",55.78,495,532,577,631,782,833,961]
["Support Services Lvl 7",20,null,null,null,null,null,2029,"July",null,"Yakima","Zone 1",55.78,495,532,577,631,782,833,961]
[null,null,null,null,null,null,null,2030,"August",null,"Adams","Zone 2",57.84,529,569,616,673,834,889,1025]
[null,null,null,null,null,null,null,2031,"September",null,"Asotin","Zone 2",57.84,529,569,616,673,834,889,1025]
[null,null,null,null,null,null,null,2032,"October",null,"Benton","Zone 2",57.84,529,569,616,673,834,889,1025]
[null,null,null,null,null,null,null,2033,"November",null,"Chelan","Zone 2",57.84,529,569,616,673,834,889,1025]
[null,null,null,null,null,null,null,2034,"December",null,"Columbia","Zone 2",57.84,529,569,616,673,834,889,1025]
[null,null,null,null,null,null,null,null,null,null,"Douglas","Zone 2",57.84,529,569,616,673,834,889,1025]
[null,null,null,null,"Zone 1","Support Services Lvl 3",{"$f":"INDEX(D36:D42,MATCH(1,(B36:B42=E17)*(C36:C42=F17),0))","v":577},null,null,null,"Ferry","Zone 2",57.84,529,569,616,673,834,889,1025]
[null,null,null,null,null,null,null,null,null,null,"Franklin","Zone 2",57.84,529,569,616,673,834,889,1025]
[null,null,null,null,null,null,null,null,null,null,"Garfield","Zone 2",57.84,529,569,616,673,834,889,1025]
[null,null,null,null,null,null,null,null,null,null,"Grant","Zone 2",57.84,529,569,616,673,834,889,1025]
[null,null,null,null,null,null,null,null,null,null,"Grays Harbor","Zone 2",57.84,529,569,616,673,834,889,1025]
[null,null,null,null,null,null,null,null,null,null,"Kittitas","Zone 2",57.84,529,569,616,673,834,889,1025]
[null,null,"Support Services Lvl 1","Support Services Lvl 2","Support Services Lvl 3","Support Services Lvl 4","Support Services Lvl 5","Support Services Lvl 6","Support Services Lvl 7",null,"Lewis","Zone 2",57.84,529,569,616,673,834,889,1025]
[null,"Zone 1",495,532,577,631,782,833,961,null,"Mason","Zone 2",57.84,529,569,616,673,834,889,1025]
[null,"Zone 2",529,569,616,673,834,889,1025,null,"Okanogan","Zone 2",57.84,529,569,616,673,834,889,1025]
[null,"Zone 3",508,547,592,648,803,855,987,null,"Pacific","Zone 2",57.84,529,569,616,673,834,889,1025]
[null,"Zone 4",564,607,657,718,890,948,1093,null,"Thurston","Zone 2",57.84,529,569,616,673,834,889,1025]
[null,null,null,null,null,null,null,null,null,null,"Walla Walla","Zone 2",57.84,529,569,616,673,834,889,1025]
[null,null,"Support Services Lvl 1","Support Services Lvl 2","Support Services Lvl 3","Support Services Lvl 4","Support Services Lvl 5","Support Services Lvl 6","Support Services Lvl 7",null,"Whitman","Zone 2",57.84,529,569,616,673,834,889,1025]
[null,"Zone 1",495,532,577,631,782,833,961,null,"Island","Zone 3",56.72,508,547,592,648,803,855,987]
[null,"Zone 2",529,569,616,673,834,889,1025,null,"Clallam","Zone 3",56.72,508,547,592,648,803,855,987]
[null,"Zone 3",508,547,592,648,803,855,987,null,"Clark","Zone 3",56.72,508,547,592,648,803,855,987]
[null,"Zone 4",564,607,657,718,890,948,1093,null,"Cowlitz","Zone 3",56.72,508,547,592,648,803,855,987]
[null,null,null,null,null,null,null,null,null,null,"Jefferson","Zone 3",56.72,508,547,592,648,803,855,987]
[null,null,null,null,null,null,null,null,null,null,"Kitsap","Zone 3",56.72,508,547,592,648,803,855,987]
[null,"Zone 1","Support Services Lvl 1",495,null,null,null,null,null,null,"Pierce","Zone 3",56.72,508,547,592,648,803,855,987]
[null,"Zone 1","Support Services Lvl 2",532,null,null,null,null,null,null,"San Juan","Zone 3",56.72,508,547,592,648,803,855,987]
[null,"Zone 1","Support Services Lvl 3",577,null,null,null,null,null,null,"Skagit","Zone 3",56.72,508,547,592,648,803,855,987]
[null,"Zone 1","Support Services Lvl 4",631,null,null,null,null,null,null,"Skamania","Zone 3",56.72,508,547,592,648,803,855,987]
[null,"Zone 1","Support Services Lvl 5",782,null,null,null,null,null,null,"Snohomish","Zone 3",56.72,508,547,592,648,803,855,987]
[null,"Zone 1","Support Services Lvl 6",833,null,null,null,null,null,null,"Wahkiakum","Zone 3",56.72,508,547,592,648,803,855,987]
[null,"Zone 1","Support Services Lvl 7",961,null,null,null,null,null,null,"Whatcom","Zone 3",56.72,508,547,592,648,803,855,987]
[null,"Zone 2","Support Services Lvl 1",529,null,null,null,null,null,null,"King","Zone 4",62.68,564,607,657,718,890,948,1093]
[null,"Zone 2","Support Services Lvl 2",569]
[null,"Zone 2","Support Services Lvl 3",616]
[null,"Zone 2","Support Services Lvl 4",673]
[null,"Zone 2","Support Services Lvl 5",834]
[null,"Zone 2","Support Services Lvl 6",889]
[null,"Zone 2","Support Services Lvl 7",1025]
[null,"Zone 3","Support Services Lvl 1",508]
[null,"Zone 3","Support Services Lvl 2",547]
[null,"Zone 3","Support Services Lvl 3",592]
[null,"Zone 3","Support Services Lvl 4",648]
[null,"Zone 3","Support Services Lvl 5",803,null,null,null,{"$f":"INDEX(IndexMatch!C:C,MATCH(1,(IndexMatch!A:A=VLOOKUP(Roster!H2,K:L,2,0))*(IndexMatch!B:B=F17),0))","v":{"$error":"#N/A"}}]
[null,"Zone 3","Support Services Lvl 6",855]
[null,"Zone 3","Support Services Lvl 7",987]
[null,"Zone 4","Support Services Lvl 1",564]
[null,"Zone 4","Support Services Lvl 2",607]
[null,"Zone 4","Support Services Lvl 3",657]
[null,"Zone 4","Support Services Lvl 4",718]
[null,"Zone 4","Support Services Lvl 5",890]
[null,"Zone 4","Support Services Lvl 6",948]
[null,"Zone 4","Support Services Lvl 7",1093]

{"sheet":"IndexMatch","index":5,"n_rows":35,"n_cols":3,"rows_kept":35,"cut":false,"hidden":true,"merged":[]}
["Select","Support Services Lvl 1",0]
["Select","Support Services Lvl 2",0]
["Select","Support Services Lvl 3",0]
["Select","Support Services Lvl 4",0]
["Select","Support Services Lvl 5",0]
["Select","Support Services Lvl 6",0]
["Select","Support Services Lvl 7",0]
["Zone 1","Support Services Lvl 1",495]
["Zone 1","Support Services Lvl 2",532]
["Zone 1","Support Services Lvl 3",577]
["Zone 1","Support Services Lvl 4",631]
["Zone 1","Support Services Lvl 5",782]
["Zone 1","Support Services Lvl 6",833]
["Zone 1","Support Services Lvl 7",961]
["Zone 2","Support Services Lvl 1",529]
["Zone 2","Support Services Lvl 2",569]
["Zone 2","Support Services Lvl 3",616]
["Zone 2","Support Services Lvl 4",673]
["Zone 2","Support Services Lvl 5",834]
["Zone 2","Support Services Lvl 6",889]
["Zone 2","Support Services Lvl 7",1025]
["Zone 3","Support Services Lvl 1",508]
["Zone 3","Support Services Lvl 2",547]
["Zone 3","Support Services Lvl 3",592]
["Zone 3","Support Services Lvl 4",648]
["Zone 3","Support Services Lvl 5",803]
["Zone 3","Support Services Lvl 6",855]
["Zone 3","Support Services Lvl 7",987]
["Zone 4","Support Services Lvl 1",564]
["Zone 4","Support Services Lvl 2",607]
["Zone 4","Support Services Lvl 3",657]
["Zone 4","Support Services Lvl 4",718]
["Zone 4","Support Services Lvl 5",890]
["Zone 4","Support Services Lvl 6",948]
["Zone 4","Support Services Lvl 7",1093]